BDBM50398199 CHEMBL1738934
SMILES: CO[C@H]([C@H](O)[C@@H](O)[C@H](O)\C=C\C(C)(C)C)C(=O)NCC(N)=O
InChI Key: InChIKey=AVLHKXXFCITIMH-JXTMJACFSA-N
Data: 1 IC50
PDB links: 2 PDB IDs match this monomer.
Activity Spreadsheet -- Enzyme Inhibition Constant Data from BindingDB
Found 1 hit for monomerid = 50398199
Trg + Lig
Ki
nM
ΔG°
kcal/mole
IC50
nM
Kd
nM
EC50/IC50
nM
koff
s-1
kon
M-1s-1
pHTemp
°C
Methionine Aminopeptidase Type 1 (MetAP1)
(Homo sapiens (Human))
BDBM50398199
(CHEMBL1738934)
Show SMILES CO[C@H]([C@H](O)[C@@H](O)[C@H](O)\C=C\C(C)(C)C)C(=O)NCC(N)=O |r|
Show InChI InChI=1S/C14H26N2O6/c1-14(2,3)6-5-8(17)10(19)11(20)12(22-4)13(21)16-7-9(15)18/h5-6,8,10-12,17,19-20H,7H2,1-4H3,(H2,15,18)(H,16,21)/b6-5+/t8-,10+,11-,12-/m1/s1
Reactome pathway
n/an/a 3.59E+3n/an/an/an/an/an/a
Indiana University School of Medicine
Curated by ChEMBL
Assay Description
Inhibition of Mn(II) form of human methionine aminopeptidase1 expressed in Escherichia coli at 100 mM
J Med Chem 55: 8021-7 (2012)
Article DOI: 10.1021/jm3008695
BindingDB Entry DOI: 10.7270/Q2T43V72
3D
3D Structure (crystal)