BDBM50398333 CHEMBL2178579
SMILES: Oc1c(NC(=O)Nc2cccc(F)c2Cl)ccc(Cl)c1S(=O)(=O)N1CCNCC1
InChI Key: InChIKey=YQYFEGTYCUQBEI-UHFFFAOYSA-N
Data: 4 IC50
Activity Spreadsheet -- Enzyme Inhibition Constant Data from BindingDB
Found 4 hits for monomerid = 50398333
Trg + Lig
Ki
nM
ΔG°
kcal/mole
IC50
nM
Kd
nM
EC50/IC50
nM
koff
s-1
kon
M-1s-1
pHTemp
°C
C-X-C chemokine receptor type 2
(Homo sapiens (Human))
BDBM50398333
(CHEMBL2178579)
Show SMILES Oc1c(NC(=O)Nc2cccc(F)c2Cl)ccc(Cl)c1S(=O)(=O)N1CCNCC1
Show InChI InChI=1S/C17H17Cl2FN4O4S/c18-10-4-5-13(23-17(26)22-12-3-1-2-11(20)14(12)19)15(25)16(10)29(27,28)24-8-6-21-7-9-24/h1-5,21,25H,6-9H2,(H2,22,23,26)
Reactome pathway
n/an/a 311n/an/an/an/an/an/a
National Heart and Lung Institute
Curated by ChEMBL
Assay Description
Antagonist activity at CXCR2 assessed as inhibition of neutrophil shape change
J Med Chem 55: 9363-92 (2012)
Article DOI: 10.1021/jm300682j
BindingDB Entry DOI: 10.7270/Q2862HKR
C-X-C chemokine receptor type 1
(Homo sapiens (Human))
BDBM50398333
(CHEMBL2178579)
Show SMILES Oc1c(NC(=O)Nc2cccc(F)c2Cl)ccc(Cl)c1S(=O)(=O)N1CCNCC1
Show InChI InChI=1S/C17H17Cl2FN4O4S/c18-10-4-5-13(23-17(26)22-12-3-1-2-11(20)14(12)19)15(25)16(10)29(27,28)24-8-6-21-7-9-24/h1-5,21,25H,6-9H2,(H2,22,23,26)
n/an/a>1.00E+4n/an/an/an/an/an/a
National Heart and Lung Institute
Curated by ChEMBL
Assay Description
Binding affinity to CXCR1
J Med Chem 55: 9363-92 (2012)
Article DOI: 10.1021/jm300682j
BindingDB Entry DOI: 10.7270/Q2862HKR
C-X-C chemokine receptor type 2
(Homo sapiens (Human))
BDBM50398333
(CHEMBL2178579)
Show SMILES Oc1c(NC(=O)Nc2cccc(F)c2Cl)ccc(Cl)c1S(=O)(=O)N1CCNCC1
Show InChI InChI=1S/C17H17Cl2FN4O4S/c18-10-4-5-13(23-17(26)22-12-3-1-2-11(20)14(12)19)15(25)16(10)29(27,28)24-8-6-21-7-9-24/h1-5,21,25H,6-9H2,(H2,22,23,26)
Reactome pathway
n/an/a 5.10n/an/an/an/an/an/a
National Heart and Lung Institute
Curated by ChEMBL
Assay Description
Binding affinity to CXCR2
J Med Chem 55: 9363-92 (2012)
Article DOI: 10.1021/jm300682j
BindingDB Entry DOI: 10.7270/Q2862HKR
C-X-C chemokine receptor type 2
(Homo sapiens (Human))
BDBM50398333
(CHEMBL2178579)
Show SMILES Oc1c(NC(=O)Nc2cccc(F)c2Cl)ccc(Cl)c1S(=O)(=O)N1CCNCC1
Show InChI InChI=1S/C17H17Cl2FN4O4S/c18-10-4-5-13(23-17(26)22-12-3-1-2-11(20)14(12)19)15(25)16(10)29(27,28)24-8-6-21-7-9-24/h1-5,21,25H,6-9H2,(H2,22,23,26)
Reactome pathway
n/an/a 261n/an/an/an/an/an/a
National Heart and Lung Institute
Curated by ChEMBL
Assay Description
Antagonist activity at CXCR2 assessed as inhibition of neutrophil CD11b up-regulation
J Med Chem 55: 9363-92 (2012)
Article DOI: 10.1021/jm300682j
BindingDB Entry DOI: 10.7270/Q2862HKR