BDBM50398360 CHEMBL2178597
SMILES: C[C@@H]1C[C@@H](O)c2ncnc(N3CCN(CC3)C(=O)[C@H](CNC(C)(C)C)c3ccc(c(F)c3)C(F)(F)F)c12
InChI Key: InChIKey=OSDYJCFGRBVWAT-WRWLIDTKSA-N
Data: 4 IC50
Activity Spreadsheet -- Enzyme Inhibition Constant Data from BindingDB
Found 4 hits for monomerid = 50398360
Trg + Lig
Ki
nM
ΔG°
kcal/mole
IC50
nM
Kd
nM
EC50/IC50
nM
koff
s-1
kon
M-1s-1
pHTemp
°C
RAC-alpha serine/threonine-protein kinase
(Homo sapiens (Human))
BDBM50398360
(CHEMBL2178597)
Show SMILES C[C@@H]1C[C@@H](O)c2ncnc(N3CCN(CC3)C(=O)[C@H](CNC(C)(C)C)c3ccc(c(F)c3)C(F)(F)F)c12 |r|
Show InChI InChI=1S/C26H33F4N5O2/c1-15-11-20(36)22-21(15)23(32-14-31-22)34-7-9-35(10-8-34)24(37)17(13-33-25(2,3)4)16-5-6-18(19(27)12-16)26(28,29)30/h5-6,12,14-15,17,20,33,36H,7-11,13H2,1-4H3/t15-,17-,20-/m1/s1
n/an/a 3n/an/an/an/an/an/a
Array BioPharma Inc.
Curated by ChEMBL
Assay Description
Competitive inhibition of wild-type full-length amino-terminal polyhistidine-tagged human Akt1 expressed in recombinant baculovirus system using fluo...
J Med Chem 55: 8110-27 (2012)
Article DOI: 10.1021/jm301024w
BindingDB Entry DOI: 10.7270/Q20P1160
Serine/threonine-protein kinase AKT2
(Homo sapiens (Human))
BDBM50398360
(CHEMBL2178597)
Show SMILES C[C@@H]1C[C@@H](O)c2ncnc(N3CCN(CC3)C(=O)[C@H](CNC(C)(C)C)c3ccc(c(F)c3)C(F)(F)F)c12 |r|
Show InChI InChI=1S/C26H33F4N5O2/c1-15-11-20(36)22-21(15)23(32-14-31-22)34-7-9-35(10-8-34)24(37)17(13-33-25(2,3)4)16-5-6-18(19(27)12-16)26(28,29)30/h5-6,12,14-15,17,20,33,36H,7-11,13H2,1-4H3/t15-,17-,20-/m1/s1
n/an/a 5n/an/an/an/an/an/a
Array BioPharma Inc.
Curated by ChEMBL
Assay Description
Competitive inhibition of wild-type full-length amino-terminal polyhistidine-tagged human Akt2 expressed in recombinant baculovirus system using fluo...
J Med Chem 55: 8110-27 (2012)
Article DOI: 10.1021/jm301024w
BindingDB Entry DOI: 10.7270/Q20P1160
Serine/threonine-protein kinase AKT
(Homo sapiens (Human))
BDBM50398360
(CHEMBL2178597)
Show SMILES C[C@@H]1C[C@@H](O)c2ncnc(N3CCN(CC3)C(=O)[C@H](CNC(C)(C)C)c3ccc(c(F)c3)C(F)(F)F)c12 |r|
Show InChI InChI=1S/C26H33F4N5O2/c1-15-11-20(36)22-21(15)23(32-14-31-22)34-7-9-35(10-8-34)24(37)17(13-33-25(2,3)4)16-5-6-18(19(27)12-16)26(28,29)30/h5-6,12,14-15,17,20,33,36H,7-11,13H2,1-4H3/t15-,17-,20-/m1/s1
NCI pathway
Reactome pathway
n/an/a 3n/an/an/an/an/an/a
Array BioPharma Inc.
Curated by ChEMBL
Assay Description
Competitive inhibition of wild-type full-length amino-terminal polyhistidine-tagged human Akt3 expressed in recombinant baculovirus system using fluo...
J Med Chem 55: 8110-27 (2012)
Article DOI: 10.1021/jm301024w
BindingDB Entry DOI: 10.7270/Q20P1160
RAC-alpha serine/threonine-protein kinase
(Homo sapiens (Human))
BDBM50398360
(CHEMBL2178597)
Show SMILES C[C@@H]1C[C@@H](O)c2ncnc(N3CCN(CC3)C(=O)[C@H](CNC(C)(C)C)c3ccc(c(F)c3)C(F)(F)F)c12 |r|
Show InChI InChI=1S/C26H33F4N5O2/c1-15-11-20(36)22-21(15)23(32-14-31-22)34-7-9-35(10-8-34)24(37)17(13-33-25(2,3)4)16-5-6-18(19(27)12-16)26(28,29)30/h5-6,12,14-15,17,20,33,36H,7-11,13H2,1-4H3/t15-,17-,20-/m1/s1
n/an/a 92n/an/an/an/an/an/a
Array BioPharma Inc.
Curated by ChEMBL
Assay Description
Competitive inhibition of wild-type full-length amino-terminal polyhistidine-tagged human Akt1 expressed in recombinant baculovirus system using fluo...
J Med Chem 55: 8110-27 (2012)
Article DOI: 10.1021/jm301024w
BindingDB Entry DOI: 10.7270/Q20P1160