BDBM50398458 CHEMBL2179117
SMILES: CS(=O)c1ccc(cc1)-c1nc(c([nH]1)-c1ccc(F)cc1)-c1ccnc2[nH]c(cc12)-c1ccccc1
InChI Key: InChIKey=WHDBIDNTUDFXDZ-UHFFFAOYSA-N
Data: 1 IC50
Activity Spreadsheet -- Enzyme Inhibition Constant Data from BindingDB
Found 1 hit for monomerid = 50398458
Trg + Lig
Ki
nM
ΔG°
kcal/mole
IC50
nM
Kd
nM
EC50/IC50
nM
koff
s-1
kon
M-1s-1
pHTemp
°C
Mitogen-activated protein kinase 14
(Homo sapiens (Human))
BDBM50398458
(CHEMBL2179117)
Show SMILES CS(=O)c1ccc(cc1)-c1nc(c([nH]1)-c1ccc(F)cc1)-c1ccnc2[nH]c(cc12)-c1ccccc1
Show InChI InChI=1S/C29H21FN4OS/c1-36(35)22-13-9-20(10-14-22)28-33-26(19-7-11-21(30)12-8-19)27(34-28)23-15-16-31-29-24(23)17-25(32-29)18-5-3-2-4-6-18/h2-17H,1H3,(H,31,32)(H,33,34)
NCI pathway
Reactome pathway
n/an/a 8n/an/an/an/an/an/a
University of Tuebingen
Curated by ChEMBL
Assay Description
Inhibition of p38alpha MAPK
J Med Chem 55: 8429-39 (2012)
Article DOI: 10.1021/jm300852w
BindingDB Entry DOI: 10.7270/Q2765GGT