BDBM50398470 CHEMBL2179122
SMILES: Fc1ccc(cc1)-c1[nH]c(nc1-c1ncnc2nc[nH]c12)-c1ccccc1
InChI Key: InChIKey=DGADXHKVMAJZTI-UHFFFAOYSA-N
Data: 1 IC50
Activity Spreadsheet -- Enzyme Inhibition Constant Data from BindingDB
Found 1 hit for monomerid = 50398470
Trg + Lig
Ki
nM
ΔG°
kcal/mole
IC50
nM
Kd
nM
EC50/IC50
nM
koff
s-1
kon
M-1s-1
pHTemp
°C
Mitogen-activated protein kinase 14
(Homo sapiens (Human))
BDBM50398470
(CHEMBL2179122)
Show SMILES Fc1ccc(cc1)-c1[nH]c(nc1-c1ncnc2nc[nH]c12)-c1ccccc1
Show InChI InChI=1S/C20H13FN6/c21-14-8-6-12(7-9-14)15-17(16-18-20(24-10-22-16)25-11-23-18)27-19(26-15)13-4-2-1-3-5-13/h1-11H,(H,26,27)(H,22,23,24,25)
NCI pathway
Reactome pathway
n/an/a 740n/an/an/an/an/an/a
University of Tuebingen
Curated by ChEMBL
Assay Description
Inhibition of p38alpha MAPK
J Med Chem 55: 8429-39 (2012)
Article DOI: 10.1021/jm300852w
BindingDB Entry DOI: 10.7270/Q2765GGT