BDBM50398477 CHEMBL2179132
SMILES: CC(C)CNC(=O)[C@@H](NC[C@H](Cc1ccccc1)NC(=O)c1cc(cc(c1)C(=O)N[C@H](C)c1ccccc1)N(C)S(C)(=O)=O)[C@@H](C)O
InChI Key: InChIKey=UZFAOTIMARRSKT-TYUOOWEOSA-N
Data: 1 KI  1 IC50
PDB links: 1 PDB ID matches this monomer.
Activity Spreadsheet -- Enzyme Inhibition Constant Data from BindingDB
Found 2 hits for monomerid = 50398477
Trg + Lig
Ki
nM
ΔG°
kcal/mole
IC50
nM
Kd
nM
EC50/IC50
nM
koff
s-1
kon
M-1s-1
pHTemp
°C
Beta-secretase 1
(Homo sapiens (Human))
BDBM50398477
(CHEMBL2179132)
Show SMILES CC(C)CNC(=O)[C@@H](NC[C@H](Cc1ccccc1)NC(=O)c1cc(cc(c1)C(=O)N[C@H](C)c1ccccc1)N(C)S(C)(=O)=O)[C@@H](C)O |r|
Show InChI InChI=1S/C35H47N5O6S/c1-23(2)21-37-35(44)32(25(4)41)36-22-30(17-26-13-9-7-10-14-26)39-34(43)29-18-28(19-31(20-29)40(5)47(6,45)46)33(42)38-24(3)27-15-11-8-12-16-27/h7-16,18-20,23-25,30,32,36,41H,17,21-22H2,1-6H3,(H,37,44)(H,38,42)(H,39,43)/t24-,25-,30+,32+/m1/s1
99n/an/an/an/an/an/an/an/a
Purdue University
Curated by ChEMBL
Assay Description
Inhibition of recombinant BACE1 expressed in Escherichia coli using Arg- Glu(EDANS)-Glu-Val-Asn-Leu-Asp-Ala-Glu-Phe-Lys(Dabcyl)-Arg as substrate by f...
J Med Chem 55: 9195-207 (2012)
Article DOI: 10.1021/jm3008823
BindingDB Entry DOI: 10.7270/Q23F4QT0
3D
3D Structure (crystal)
Beta-secretase 1
(Homo sapiens (Human))
BDBM50398477
(CHEMBL2179132)
Show SMILES CC(C)CNC(=O)[C@@H](NC[C@H](Cc1ccccc1)NC(=O)c1cc(cc(c1)C(=O)N[C@H](C)c1ccccc1)N(C)S(C)(=O)=O)[C@@H](C)O |r|
Show InChI InChI=1S/C35H47N5O6S/c1-23(2)21-37-35(44)32(25(4)41)36-22-30(17-26-13-9-7-10-14-26)39-34(43)29-18-28(19-31(20-29)40(5)47(6,45)46)33(42)38-24(3)27-15-11-8-12-16-27/h7-16,18-20,23-25,30,32,36,41H,17,21-22H2,1-6H3,(H,37,44)(H,38,42)(H,39,43)/t24-,25-,30+,32+/m1/s1
n/an/a>1.00E+3n/an/an/an/an/an/a
Purdue University
Curated by ChEMBL
Assay Description
Inhibition of BACE1 in human neuroblastoma cells
J Med Chem 55: 9195-207 (2012)
Article DOI: 10.1021/jm3008823
BindingDB Entry DOI: 10.7270/Q23F4QT0
3D
3D Structure (crystal)