BDBM50398509 CHEMBL2178065
SMILES: CCCCN(C)c1nc(ccc1CNC(=O)C(C)c1ccc(NS(C)(=O)=O)c(F)c1)C(F)(F)F
InChI Key: InChIKey=OEVLPZUWWFFLRL-UHFFFAOYSA-N
Data: 1 KI  1 IC50
Activity Spreadsheet -- Enzyme Inhibition Constant Data from BindingDB
Found 2 hits for monomerid = 50398509
Trg + Lig
Ki
nM
ΔG°
kcal/mole
IC50
nM
Kd
nM
EC50/IC50
nM
koff
s-1
kon
M-1s-1
pHTemp
°C
Transient receptor potential cation channel subfamily V member 1
(Homo sapiens (Human))
BDBM50398509
(CHEMBL2178065)
Show SMILES CCCCN(C)c1nc(ccc1CNC(=O)C(C)c1ccc(NS(C)(=O)=O)c(F)c1)C(F)(F)F
Show InChI InChI=1S/C22H28F4N4O3S/c1-5-6-11-30(3)20-16(8-10-19(28-20)22(24,25)26)13-27-21(31)14(2)15-7-9-18(17(23)12-15)29-34(4,32)33/h7-10,12,14,29H,5-6,11,13H2,1-4H3,(H,27,31)
Reactome pathway
0.800n/an/an/an/an/an/an/an/a
Seoul National University
Curated by ChEMBL
Assay Description
Antagonist activity at human TRPV1 expressed in CHOK1 cells assessed as inhibition of capsaicin-induced activity by FLIPR assay
J Med Chem 55: 8392-408 (2012)
Article DOI: 10.1021/jm300780p
BindingDB Entry DOI: 10.7270/Q2TX3GH1
Transient receptor potential cation channel subfamily V member 1
(Homo sapiens (Human))
BDBM50398509
(CHEMBL2178065)
Show SMILES CCCCN(C)c1nc(ccc1CNC(=O)C(C)c1ccc(NS(C)(=O)=O)c(F)c1)C(F)(F)F
Show InChI InChI=1S/C22H28F4N4O3S/c1-5-6-11-30(3)20-16(8-10-19(28-20)22(24,25)26)13-27-21(31)14(2)15-7-9-18(17(23)12-15)29-34(4,32)33/h7-10,12,14,29H,5-6,11,13H2,1-4H3,(H,27,31)
Reactome pathway
n/an/a 21.3n/an/an/an/an/an/a
Seoul National University
Curated by ChEMBL
Assay Description
Antagonist activity at human TRPV1 expressed in CHOK1 cells assessed as inhibition of pH-induced activity by FLIPR assay
J Med Chem 55: 8392-408 (2012)
Article DOI: 10.1021/jm300780p
BindingDB Entry DOI: 10.7270/Q2TX3GH1