BDBM50398549 CHEMBL2177404
SMILES: CC(C(=O)NCc1ccc(nc1N1CCC(F)CC1)C(F)(F)F)c1ccc(NS(C)(=O)=O)c(F)c1
InChI Key: InChIKey=GTZMAKRJIKZWAH-UHFFFAOYSA-N
Data: 1 KI  1 IC50
Activity Spreadsheet -- Enzyme Inhibition Constant Data from BindingDB
Found 2 hits for monomerid = 50398549
Trg + Lig
Ki
nM
ΔG°
kcal/mole
IC50
nM
Kd
nM
EC50/IC50
nM
koff
s-1
kon
M-1s-1
pHTemp
°C
Transient receptor potential cation channel subfamily V member 1
(Homo sapiens (Human))
BDBM50398549
(CHEMBL2177404)
Show SMILES CC(C(=O)NCc1ccc(nc1N1CCC(F)CC1)C(F)(F)F)c1ccc(NS(C)(=O)=O)c(F)c1
Show InChI InChI=1S/C22H25F5N4O3S/c1-13(14-3-5-18(17(24)11-14)30-35(2,33)34)21(32)28-12-15-4-6-19(22(25,26)27)29-20(15)31-9-7-16(23)8-10-31/h3-6,11,13,16,30H,7-10,12H2,1-2H3,(H,28,32)
Reactome pathway
0.5n/an/an/an/an/an/an/an/a
Seoul National University
Curated by ChEMBL
Assay Description
Antagonist activity at human TRPV1 expressed in CHOK1 cells assessed as inhibition of capsaicin-induced activity by FLIPR assay
J Med Chem 55: 8392-408 (2012)
Article DOI: 10.1021/jm300780p
BindingDB Entry DOI: 10.7270/Q2TX3GH1
Transient receptor potential cation channel subfamily V member 1
(Homo sapiens (Human))
BDBM50398549
(CHEMBL2177404)
Show SMILES CC(C(=O)NCc1ccc(nc1N1CCC(F)CC1)C(F)(F)F)c1ccc(NS(C)(=O)=O)c(F)c1
Show InChI InChI=1S/C22H25F5N4O3S/c1-13(14-3-5-18(17(24)11-14)30-35(2,33)34)21(32)28-12-15-4-6-19(22(25,26)27)29-20(15)31-9-7-16(23)8-10-31/h3-6,11,13,16,30H,7-10,12H2,1-2H3,(H,28,32)
Reactome pathway
n/an/a 19.8n/an/an/an/an/an/a
Seoul National University
Curated by ChEMBL
Assay Description
Antagonist activity at human TRPV1 expressed in CHOK1 cells assessed as inhibition of pH-induced activity by FLIPR assay
J Med Chem 55: 8392-408 (2012)
Article DOI: 10.1021/jm300780p
BindingDB Entry DOI: 10.7270/Q2TX3GH1