BDBM50398565 CHEMBL2179195
SMILES: CCCCN(C1CCOCC1)c1c(OC)nn2c(csc12)-c1c(OC)cc(COCC)cc1OC
InChI Key: InChIKey=MKMSLJYQGXJIQH-UHFFFAOYSA-N
Data: 3 IC50
Activity Spreadsheet -- Enzyme Inhibition Constant Data from BindingDB
Found 3 hits for monomerid = 50398565
Trg + Lig
Ki
nM
ΔG°
kcal/mole
IC50
nM
Kd
nM
EC50/IC50
nM
koff
s-1
kon
M-1s-1
pHTemp
°C
Corticotropin releasing factor receptor 2
(Homo sapiens (Human))
BDBM50398565
(CHEMBL2179195)
Show SMILES CCCCN(C1CCOCC1)c1c(OC)nn2c(csc12)-c1c(OC)cc(COCC)cc1OC |(2.51,-41.6,;3.29,-42.93,;4.83,-42.92,;5.59,-41.58,;7.13,-41.58,;7.85,-40.22,;9.39,-40.17,;10.11,-38.82,;9.3,-37.51,;7.76,-37.56,;7.03,-38.92,;7.67,-43.03,;6.79,-44.29,;5.26,-44.32,;4.52,-45.67,;7.72,-45.51,;9.18,-45.01,;10.66,-45.45,;11.53,-44.19,;10.6,-42.96,;9.15,-43.47,;11.4,-46.8,;10.62,-48.12,;9.08,-48.09,;8.28,-49.41,;11.36,-49.46,;12.9,-49.49,;13.65,-50.84,;15.19,-50.87,;15.93,-52.21,;17.47,-52.24,;13.69,-48.17,;12.94,-46.82,;13.74,-45.5,;12.99,-44.16,)|
Show InChI InChI=1S/C26H37N3O5S/c1-6-8-11-28(19-9-12-34-13-10-19)24-25(32-5)27-29-20(17-35-26(24)29)23-21(30-3)14-18(16-33-7-2)15-22(23)31-4/h14-15,17,19H,6-13,16H2,1-5H3
n/an/a>1.00E+4n/an/an/an/an/an/a
Eisai Co., Ltd.
Curated by ChEMBL
Assay Description
Antagonist activity at human CRF2 receptor assessed as inhibition of CRF-induced intracellular cAMP accumulation
J Med Chem 55: 8450-63 (2012)
Article DOI: 10.1021/jm300864p
BindingDB Entry DOI: 10.7270/Q2KD202P
Corticotropin releasing factor receptor 1
(Homo sapiens (Human))
BDBM50398565
(CHEMBL2179195)
Show SMILES CCCCN(C1CCOCC1)c1c(OC)nn2c(csc12)-c1c(OC)cc(COCC)cc1OC |(2.51,-41.6,;3.29,-42.93,;4.83,-42.92,;5.59,-41.58,;7.13,-41.58,;7.85,-40.22,;9.39,-40.17,;10.11,-38.82,;9.3,-37.51,;7.76,-37.56,;7.03,-38.92,;7.67,-43.03,;6.79,-44.29,;5.26,-44.32,;4.52,-45.67,;7.72,-45.51,;9.18,-45.01,;10.66,-45.45,;11.53,-44.19,;10.6,-42.96,;9.15,-43.47,;11.4,-46.8,;10.62,-48.12,;9.08,-48.09,;8.28,-49.41,;11.36,-49.46,;12.9,-49.49,;13.65,-50.84,;15.19,-50.87,;15.93,-52.21,;17.47,-52.24,;13.69,-48.17,;12.94,-46.82,;13.74,-45.5,;12.99,-44.16,)|
Show InChI InChI=1S/C26H37N3O5S/c1-6-8-11-28(19-9-12-34-13-10-19)24-25(32-5)27-29-20(17-35-26(24)29)23-21(30-3)14-18(16-33-7-2)15-22(23)31-4/h14-15,17,19H,6-13,16H2,1-5H3
Reactome pathway
n/an/a 70n/an/an/an/an/an/a
Eisai Co., Ltd.
Curated by ChEMBL
Assay Description
Displacement of [125I]CRF from human CRF1 receptor expressed in HEK293 cells after 2 hrs by scintillation proximity assay
J Med Chem 55: 8450-63 (2012)
Article DOI: 10.1021/jm300864p
BindingDB Entry DOI: 10.7270/Q2KD202P
Corticotropin releasing factor receptor 1
(Homo sapiens (Human))
BDBM50398565
(CHEMBL2179195)
Show SMILES CCCCN(C1CCOCC1)c1c(OC)nn2c(csc12)-c1c(OC)cc(COCC)cc1OC |(2.51,-41.6,;3.29,-42.93,;4.83,-42.92,;5.59,-41.58,;7.13,-41.58,;7.85,-40.22,;9.39,-40.17,;10.11,-38.82,;9.3,-37.51,;7.76,-37.56,;7.03,-38.92,;7.67,-43.03,;6.79,-44.29,;5.26,-44.32,;4.52,-45.67,;7.72,-45.51,;9.18,-45.01,;10.66,-45.45,;11.53,-44.19,;10.6,-42.96,;9.15,-43.47,;11.4,-46.8,;10.62,-48.12,;9.08,-48.09,;8.28,-49.41,;11.36,-49.46,;12.9,-49.49,;13.65,-50.84,;15.19,-50.87,;15.93,-52.21,;17.47,-52.24,;13.69,-48.17,;12.94,-46.82,;13.74,-45.5,;12.99,-44.16,)|
Show InChI InChI=1S/C26H37N3O5S/c1-6-8-11-28(19-9-12-34-13-10-19)24-25(32-5)27-29-20(17-35-26(24)29)23-21(30-3)14-18(16-33-7-2)15-22(23)31-4/h14-15,17,19H,6-13,16H2,1-5H3
Reactome pathway
n/an/a 7.10n/an/an/an/an/an/a
Eisai Co., Ltd.
Curated by ChEMBL
Assay Description
Antagonist activity at CRF1 receptor in human IMR32 cells assessed as inhibition of CRF-induced intracellular cAMP accumulation after 30 mins by immu...
J Med Chem 55: 8450-63 (2012)
Article DOI: 10.1021/jm300864p
BindingDB Entry DOI: 10.7270/Q2KD202P