null
SMILES: C[C@H]1C[C@@]2(CN(C)S(=O)(=O)N2c2cccc(F)c2)CCN1Cc1ccc(O)c(Cl)c1
InChI Key: InChIKey=OPALZHQMUWJZMW-YCRPNKLZSA-N
Activity Spreadsheet -- Enzyme Inhibition Constant Data from BindingDB
Found 2 hits for monomerid = 50398612
Trg + Lig
Ki
nM
ΔG°
kcal/mole
IC50
nM
Kd
nM
EC50/IC50
nM
koff
s-1
kon
M-1s-1
pHTemp
°C
Beta-secretase 1
(Homo sapiens (Human))
BDBM50398612
(CHEMBL2177468)
Show SMILES C[C@H]1C[C@@]2(CN(C)S(=O)(=O)N2c2cccc(F)c2)CCN1Cc1ccc(O)c(Cl)c1 |r|
Show InChI InChI=1S/C21H25ClFN3O3S/c1-15-12-21(8-9-25(15)13-16-6-7-20(27)19(22)10-16)14-24(2)30(28,29)26(21)18-5-3-4-17(23)11-18/h3-7,10-11,15,27H,8-9,12-14H2,1-2H3/t15-,21+/m0/s1
n/an/a 1.60E+3n/an/an/an/an/an/a
Pfizer Inc.
Curated by ChEMBL
Assay Description
Inhibition of human recombinant BACE1 using K(biotin)RGLTTRPGSGLTNIKTEEISEVNLDAEFRHDSGA as substrate after 1 hr by ELISA
J Med Chem 55: 9224-39 (2012)
Article DOI: 10.1021/jm3009426
BindingDB Entry DOI: 10.7270/Q22F7PK8
Beta-secretase 1
(Homo sapiens (Human))
BDBM50398612
(CHEMBL2177468)
Show SMILES C[C@H]1C[C@@]2(CN(C)S(=O)(=O)N2c2cccc(F)c2)CCN1Cc1ccc(O)c(Cl)c1 |r|
Show InChI InChI=1S/C21H25ClFN3O3S/c1-15-12-21(8-9-25(15)13-16-6-7-20(27)19(22)10-16)14-24(2)30(28,29)26(21)18-5-3-4-17(23)11-18/h3-7,10-11,15,27H,8-9,12-14H2,1-2H3/t15-,21+/m0/s1
n/an/a 350n/an/an/an/an/an/a
Pfizer Inc.
Curated by ChEMBL
Assay Description
Inhibition of BACE1-mediated sAPPbeta production in human H4 cells expressing APP 695 after 18 hrs by ELISA
J Med Chem 55: 9224-39 (2012)
Article DOI: 10.1021/jm3009426
BindingDB Entry DOI: 10.7270/Q22F7PK8