BDBM50398659 CHEMBL2178123
SMILES: COc1cc(ccc1Nc1ncc(Br)c(OC)n1)C(=O)N1CCOCC1
InChI Key: InChIKey=KPZORBBLNOOGPP-UHFFFAOYSA-N
Data: 1 KI  1 IC50
Activity Spreadsheet -- Enzyme Inhibition Constant Data from BindingDB
Found 2 hits for monomerid = 50398659
Trg + Lig
Ki
nM
ΔG°
kcal/mole
IC50
nM
Kd
nM
EC50/IC50
nM
koff
s-1
kon
M-1s-1
pHTemp
°C
Leucine-rich repeat serine/threonine-protein kinase 2 (LRRK2)
(Homo sapiens (Human))
BDBM50398659
(CHEMBL2178123)
Show SMILES COc1cc(ccc1Nc1ncc(Br)c(OC)n1)C(=O)N1CCOCC1
Show InChI InChI=1S/C17H19BrN4O4/c1-24-14-9-11(16(23)22-5-7-26-8-6-22)3-4-13(14)20-17-19-10-12(18)15(21-17)25-2/h3-4,9-10H,5-8H2,1-2H3,(H,19,20,21)
5n/an/an/an/an/an/an/an/a
Genentech
Curated by ChEMBL
Assay Description
Inhibition of LRRK2 using FAM-LRRKtide as substrate after 120 mins by microfluidic capillary electrophoresis assay
J Med Chem 55: 9416-33 (2012)
Article DOI: 10.1021/jm301020q
BindingDB Entry DOI: 10.7270/Q2P55PN7
Leucine-rich repeat serine/threonine-protein kinase 2 (LRRK2)
(Homo sapiens (Human))
BDBM50398659
(CHEMBL2178123)
Show SMILES COc1cc(ccc1Nc1ncc(Br)c(OC)n1)C(=O)N1CCOCC1
Show InChI InChI=1S/C17H19BrN4O4/c1-24-14-9-11(16(23)22-5-7-26-8-6-22)3-4-13(14)20-17-19-10-12(18)15(21-17)25-2/h3-4,9-10H,5-8H2,1-2H3,(H,19,20,21)
n/an/a 53n/an/an/an/an/an/a
Genentech
Curated by ChEMBL
Assay Description
Inhibition of autophosphorylation of LRRK2 in human HEK293 cells
J Med Chem 55: 9416-33 (2012)
Article DOI: 10.1021/jm301020q
BindingDB Entry DOI: 10.7270/Q2P55PN7