BDBM50398679 CHEMBL2178151
SMILES: CC(C)Oc1cccc(c1)N1C[C@H]2C(=O)N(C)C(N)=N[C@]2(C1)c1cc(cs1)-c1cccc(c1)C#N
InChI Key: InChIKey=XVWWYKYWXIEDOL-HOFKKMOUSA-N
Data: 1 KI  1 IC50
Activity Spreadsheet -- Enzyme Inhibition Constant Data from BindingDB
Found 2 hits for monomerid = 50398679
Trg + Lig
Ki
nM
ΔG°
kcal/mole
IC50
nM
Kd
nM
EC50/IC50
nM
koff
s-1
kon
M-1s-1
pHTemp
°C
Beta-secretase 1
(Homo sapiens (Human))
BDBM50398679
(CHEMBL2178151)
Show SMILES CC(C)Oc1cccc(c1)N1C[C@H]2C(=O)N(C)C(N)=N[C@]2(C1)c1cc(cs1)-c1cccc(c1)C#N |r,c:19|
Show InChI InChI=1S/C27H27N5O2S/c1-17(2)34-22-9-5-8-21(12-22)32-14-23-25(33)31(3)26(29)30-27(23,16-32)24-11-20(15-35-24)19-7-4-6-18(10-19)13-28/h4-12,15,17,23H,14,16H2,1-3H3,(H2,29,30)/t23-,27-/m0/s1
15n/an/an/an/an/an/an/an/a
Merck Research Laboratories
Curated by ChEMBL
Assay Description
Inhibition of BACE1
J Med Chem 55: 9331-45 (2012)
Article DOI: 10.1021/jm301039c
BindingDB Entry DOI: 10.7270/Q2JH3NB7
Beta-secretase 1
(Homo sapiens (Human))
BDBM50398679
(CHEMBL2178151)
Show SMILES CC(C)Oc1cccc(c1)N1C[C@H]2C(=O)N(C)C(N)=N[C@]2(C1)c1cc(cs1)-c1cccc(c1)C#N |r,c:19|
Show InChI InChI=1S/C27H27N5O2S/c1-17(2)34-22-9-5-8-21(12-22)32-14-23-25(33)31(3)26(29)30-27(23,16-32)24-11-20(15-35-24)19-7-4-6-18(10-19)13-28/h4-12,15,17,23H,14,16H2,1-3H3,(H2,29,30)/t23-,27-/m0/s1
n/an/a 308n/an/an/an/an/an/a
Merck Research Laboratories
Curated by ChEMBL
Assay Description
Inhibition of BACE1 in HEK293 cells
J Med Chem 55: 9331-45 (2012)
Article DOI: 10.1021/jm301039c
BindingDB Entry DOI: 10.7270/Q2JH3NB7