BDBM50398802 CHEMBL2180066
SMILES: CC(N1CC(C1)Oc1ccc(C#N)c(Cl)c1)c1nc2n(ncc2c(=O)[nH]1)C1CCOCC1
InChI Key: InChIKey=LQTMIIHZFHLYPP-UHFFFAOYSA-N
Data: 1 IC50
Activity Spreadsheet -- Enzyme Inhibition Constant Data from BindingDB
Found 1 hit for monomerid = 50398802
Trg + Lig
Ki
nM
ΔG°
kcal/mole
IC50
nM
Kd
nM
EC50/IC50
nM
koff
s-1
kon
M-1s-1
pHTemp
°C
Phosphodiesterase 9A
(Homo sapiens (Human))
BDBM50398802
(CHEMBL2180066)
Show SMILES CC(N1CC(C1)Oc1ccc(C#N)c(Cl)c1)c1nc2n(ncc2c(=O)[nH]1)C1CCOCC1
Show InChI InChI=1S/C22H23ClN6O3/c1-13(28-11-17(12-28)32-16-3-2-14(9-24)19(23)8-16)20-26-21-18(22(30)27-20)10-25-29(21)15-4-6-31-7-5-15/h2-3,8,10,13,15,17H,4-7,11-12H2,1H3,(H,26,27,30)
n/an/a 19n/an/an/an/an/an/a
Pfizer Inc.
Curated by ChEMBL
Assay Description
Inhibition of PDE9A using [3H]cGMP as substrate after 30 mins by scintillation proximity assay
J Med Chem 55: 9055-68 (2012)
Article DOI: 10.1021/jm3009635
BindingDB Entry DOI: 10.7270/Q2CR5VHK