BDBM50398924 CHEMBL2178788
SMILES: COc1ccc2CN(CCCCCCN(C)C34CC5CC(C)(CC(C)(C5)C3)C4)CC[C@@]34C=C[C@H](O)C[C@@H]3Oc1c24
InChI Key: InChIKey=TWBWBKOQSYWKQM-ZTCKQMQQSA-N
Data: 1 KI  1 IC50
Activity Spreadsheet -- Enzyme Inhibition Constant Data from BindingDB
Found 2 hits for monomerid = 50398924
Trg + Lig
Ki
nM
ΔG°
kcal/mole
IC50
nM
Kd
nM
EC50/IC50
nM
koff
s-1
kon
M-1s-1
pHTemp
°C
Glutamate receptor ionotropic, NMDA 2B
(Rattus norvegicus (Rat))
BDBM50398924
(CHEMBL2178788)
Show SMILES COc1ccc2CN(CCCCCCN(C)C34CC5CC(C)(CC(C)(C5)C3)C4)CC[C@@]34C=C[C@H](O)C[C@@H]3Oc1c24 |r,c:34,TLB:25:23:27:18.17.19,25:18:27:23.26.22,THB:24:23:27:18.17.19,17:16:22:18.25.19,17:18:16.26.27:22,14:16:22:18.25.19|
Show InChI InChI=1S/C35H52N2O3/c1-32-18-25-19-33(2,22-32)24-34(20-25,23-32)36(3)14-7-5-6-8-15-37-16-13-35-12-11-27(38)17-29(35)40-31-28(39-4)10-9-26(21-37)30(31)35/h9-12,25,27,29,38H,5-8,13-24H2,1-4H3/t25?,27-,29-,32?,33?,34?,35-/m0/s1
5.25E+3n/an/an/an/an/an/an/an/a
Istituto Italiano di Tecnologia
Curated by ChEMBL
Assay Description
Displacement of [3H]Ifenprodil from NMDAR-2B in Sprague-Dawley rat frontal cortex homogenates after 2 hrs by liquid scintillation counting
J Med Chem 55: 9708-21 (2012)
Article DOI: 10.1021/jm3009458
BindingDB Entry DOI: 10.7270/Q2VQ33TR
Acetylcholinesterase
(Rattus norvegicus (rat))
BDBM50398924
(CHEMBL2178788)
Show SMILES COc1ccc2CN(CCCCCCN(C)C34CC5CC(C)(CC(C)(C5)C3)C4)CC[C@@]34C=C[C@H](O)C[C@@H]3Oc1c24 |r,c:34,TLB:25:23:27:18.17.19,25:18:27:23.26.22,THB:24:23:27:18.17.19,17:16:22:18.25.19,17:18:16.26.27:22,14:16:22:18.25.19|
Show InChI InChI=1S/C35H52N2O3/c1-32-18-25-19-33(2,22-32)24-34(20-25,23-32)36(3)14-7-5-6-8-15-37-16-13-35-12-11-27(38)17-29(35)40-31-28(39-4)10-9-26(21-37)30(31)35/h9-12,25,27,29,38H,5-8,13-24H2,1-4H3/t25?,27-,29-,32?,33?,34?,35-/m0/s1
n/an/a 1.03n/an/an/an/an/an/a
Istituto Italiano di Tecnologia
Curated by ChEMBL
Assay Description
Inhibition of AChE in Wistar rat brain homogenates using acetylthiocholine iodide and DTNB as substrate after 10 mins by Ellman method
J Med Chem 55: 9708-21 (2012)
Article DOI: 10.1021/jm3009458
BindingDB Entry DOI: 10.7270/Q2VQ33TR