BDBM50398993 CHEMBL2180085
SMILES: [#7]-[#6]-[#6]-[#6]-[#6@@H]-1-[#7]-[#6](=O)-[#6@@H](-[#6]-c2ccc(-[#8])cc2)-[#7]-[#6](=O)-[#6]-[#7]-[#6](=O)-[#6@H](-[#6]-c2ccc3ccccc3c2)-[#7]-[#6](=O)-[#6@H](-[#6]-[#6]-[#6]\[#7]=[#6](/[#7])-[#7])-[#7]-[#6]-1=O
InChI Key: InChIKey=ZLTWSKRUWSCNKB-XFTNXAEASA-N
Data: 2 EC50
Activity Spreadsheet -- Enzyme Inhibition Constant Data from BindingDB
Found 2 hits for monomerid = 50398993
Trg + Lig
Ki
nM
ΔG°
kcal/mole
IC50
nM
Kd
nM
EC50/IC50
nM
koff
s-1
kon
M-1s-1
pHTemp
°C
C-X-C chemokine receptor type 4 (CXCR4)
(Homo sapiens (Human))
BDBM50398993
(CHEMBL2180085)
Show SMILES [#7]-[#6]-[#6]-[#6]-[#6@@H]-1-[#7]-[#6](=O)-[#6@@H](-[#6]-c2ccc(-[#8])cc2)-[#7]-[#6](=O)-[#6]-[#7]-[#6](=O)-[#6@H](-[#6]-c2ccc3ccccc3c2)-[#7]-[#6](=O)-[#6@H](-[#6]-[#6]-[#6]\[#7]=[#6](/[#7])-[#7])-[#7]-[#6]-1=O |r|
Show InChI InChI=1S/C35H45N9O6/c36-15-3-7-26-32(48)42-27(8-4-16-39-35(37)38)33(49)44-28(19-22-9-12-23-5-1-2-6-24(23)17-22)31(47)40-20-30(46)41-29(34(50)43-26)18-21-10-13-25(45)14-11-21/h1-2,5-6,9-14,17,26-29,45H,3-4,7-8,15-16,18-20,36H2,(H,40,47)(H,41,46)(H,42,48)(H,43,50)(H,44,49)(H4,37,38,39)/t26-,27-,28-,29+/m0/s1
n/an/an/an/a 661n/an/an/an/a
University of Troms£
Curated by ChEMBL
Assay Description
Antagonist activity against human CXCR4 expressed in COS7 cells assessed as inhibition of CXCL12-induced myo-[3H]inositol production by scintillation...
J Med Chem 55: 10287-91 (2012)
Article DOI: 10.1021/jm300926y
BindingDB Entry DOI: 10.7270/Q23779T3
C-X-C chemokine receptor type 4 (CXCR4)
(Homo sapiens (Human))
BDBM50398993
(CHEMBL2180085)
Show SMILES [#7]-[#6]-[#6]-[#6]-[#6@@H]-1-[#7]-[#6](=O)-[#6@@H](-[#6]-c2ccc(-[#8])cc2)-[#7]-[#6](=O)-[#6]-[#7]-[#6](=O)-[#6@H](-[#6]-c2ccc3ccccc3c2)-[#7]-[#6](=O)-[#6@H](-[#6]-[#6]-[#6]\[#7]=[#6](/[#7])-[#7])-[#7]-[#6]-1=O |r|
Show InChI InChI=1S/C35H45N9O6/c36-15-3-7-26-32(48)42-27(8-4-16-39-35(37)38)33(49)44-28(19-22-9-12-23-5-1-2-6-24(23)17-22)31(47)40-20-30(46)41-29(34(50)43-26)18-21-10-13-25(45)14-11-21/h1-2,5-6,9-14,17,26-29,45H,3-4,7-8,15-16,18-20,36H2,(H,40,47)(H,41,46)(H,42,48)(H,43,50)(H,44,49)(H4,37,38,39)/t26-,27-,28-,29+/m0/s1
n/an/an/an/a 660n/an/an/an/a
University of Troms£
Curated by ChEMBL
Assay Description
Antagonist activity against human CXCR4 expressed in COS7 cells assessed as inhibition of CXCL12-induced myo-[3H]inositol production by scintillation...
J Med Chem 55: 10287-91 (2012)
Article DOI: 10.1021/jm300926y
BindingDB Entry DOI: 10.7270/Q23779T3