BDBM50399001 CHEMBL2180077
SMILES: [#7]\[#6](-[#7])=[#7]/[#6]-[#6]-[#6]-[#6@@H]-1-[#7]-[#6](=O)-[#6@@H](-[#6]-[#6]-[#6]\[#7]=[#6](/[#7])-[#7])-[#7]-[#6](=O)-[#6@@H](-[#6]-c2ccc(-[#8])cc2)-[#7]-[#6](=O)-[#6]-[#7]-[#6](=O)-[#6@H](-[#6]-c2ccc3ccccc3c2)-[#7]-[#6]-1=O
InChI Key: InChIKey=MBXBICVKLVYNKD-GIFPIDKJSA-N
Data: 2 EC50
Activity Spreadsheet -- Enzyme Inhibition Constant Data from BindingDB
Found 2 hits for monomerid = 50399001
Trg + Lig
Ki
nM
ΔG°
kcal/mole
IC50
nM
Kd
nM
EC50/IC50
nM
koff
s-1
kon
M-1s-1
pHTemp
°C
C-X-C chemokine receptor type 4 (CXCR4)
(Homo sapiens (Human))
BDBM50399001
(CHEMBL2180077)
Show SMILES [#7]\[#6](-[#7])=[#7]/[#6]-[#6]-[#6]-[#6@@H]-1-[#7]-[#6](=O)-[#6@@H](-[#6]-[#6]-[#6]\[#7]=[#6](/[#7])-[#7])-[#7]-[#6](=O)-[#6@@H](-[#6]-c2ccc(-[#8])cc2)-[#7]-[#6](=O)-[#6]-[#7]-[#6](=O)-[#6@H](-[#6]-c2ccc3ccccc3c2)-[#7]-[#6]-1=O |r|
Show InChI InChI=1S/C36H47N11O6/c37-35(38)41-15-3-7-26-32(51)45-27(8-4-16-42-36(39)40)33(52)47-28(19-22-9-12-23-5-1-2-6-24(23)17-22)31(50)43-20-30(49)44-29(34(53)46-26)18-21-10-13-25(48)14-11-21/h1-2,5-6,9-14,17,26-29,48H,3-4,7-8,15-16,18-20H2,(H,43,50)(H,44,49)(H,45,51)(H,46,53)(H,47,52)(H4,37,38,41)(H4,39,40,42)/t26-,27+,28+,29-/m1/s1
n/an/an/an/a 776n/an/an/an/a
University of Troms£
Curated by ChEMBL
Assay Description
Antagonist activity against human CXCR4 expressed in COS7 cells assessed as inhibition of CXCL12-induced myo-[3H]inositol production by scintillation...
J Med Chem 55: 10287-91 (2012)
Article DOI: 10.1021/jm300926y
BindingDB Entry DOI: 10.7270/Q23779T3
C-X-C chemokine receptor type 4 (CXCR4)
(Homo sapiens (Human))
BDBM50399001
(CHEMBL2180077)
Show SMILES [#7]\[#6](-[#7])=[#7]/[#6]-[#6]-[#6]-[#6@@H]-1-[#7]-[#6](=O)-[#6@@H](-[#6]-[#6]-[#6]\[#7]=[#6](/[#7])-[#7])-[#7]-[#6](=O)-[#6@@H](-[#6]-c2ccc(-[#8])cc2)-[#7]-[#6](=O)-[#6]-[#7]-[#6](=O)-[#6@H](-[#6]-c2ccc3ccccc3c2)-[#7]-[#6]-1=O |r|
Show InChI InChI=1S/C36H47N11O6/c37-35(38)41-15-3-7-26-32(51)45-27(8-4-16-42-36(39)40)33(52)47-28(19-22-9-12-23-5-1-2-6-24(23)17-22)31(50)43-20-30(49)44-29(34(53)46-26)18-21-10-13-25(48)14-11-21/h1-2,5-6,9-14,17,26-29,48H,3-4,7-8,15-16,18-20H2,(H,43,50)(H,44,49)(H,45,51)(H,46,53)(H,47,52)(H4,37,38,41)(H4,39,40,42)/t26-,27+,28+,29-/m1/s1
n/an/an/an/a 780n/an/an/an/a
University of Troms£
Curated by ChEMBL
Assay Description
Antagonist activity against human CXCR4 expressed in COS7 cells assessed as inhibition of CXCL12-induced myo-[3H]inositol production by scintillation...
J Med Chem 55: 10287-91 (2012)
Article DOI: 10.1021/jm300926y
BindingDB Entry DOI: 10.7270/Q23779T3