BDBM50399187 CHEMBL2180184
SMILES: [O-][N+](=O)c1ccc(cc1)C(=O)N1c2ccccc2Oc2ccccc12
InChI Key: InChIKey=HORYLVQODYGBBZ-UHFFFAOYSA-N
Data: 1 IC50
Activity Spreadsheet -- Enzyme Inhibition Constant Data from BindingDB
Found 1 hit for monomerid = 50399187
Trg + Lig
Ki
nM
ΔG°
kcal/mole
IC50
nM
Kd
nM
EC50/IC50
nM
koff
s-1
kon
M-1s-1
pHTemp
°C
P2X purinoceptor 4
(Homo sapiens (Human))
BDBM50399187
(CHEMBL2180184)
Show SMILES [O-][N+](=O)c1ccc(cc1)C(=O)N1c2ccccc2Oc2ccccc12
Show InChI InChI=1S/C19H12N2O4/c22-19(13-9-11-14(12-10-13)21(23)24)20-15-5-1-3-7-17(15)25-18-8-4-2-6-16(18)20/h1-12H
n/an/a 4.29E+3n/an/an/an/an/an/a
University of Bonn
Curated by ChEMBL
Assay Description
Antagonist activity at human P2X4 receptor expressed in 1321N1 cells assessed as inhibition of ATP-induced cytosolic calcium influx compound preincub...
J Med Chem 55: 9576-88 (2012)
Article DOI: 10.1021/jm300845v
BindingDB Entry DOI: 10.7270/Q2XK8GPN