BDBM50399192 CHEMBL2180156
SMILES: CC(C)[C@@H]1CC[C@@H](C)C[C@H]1OCC(=O)Nc1ccccc1OCCBr
InChI Key: InChIKey=GUQGHSLXSOGCEK-JTDSTZFVSA-N
Data: 1 IC50
Activity Spreadsheet -- Enzyme Inhibition Constant Data from BindingDB
Found 1 hit for monomerid = 50399192
Trg + Lig
Ki
nM
ΔG°
kcal/mole
IC50
nM
Kd
nM
EC50/IC50
nM
koff
s-1
kon
M-1s-1
pHTemp
°C
P2X purinoceptor 4
(Homo sapiens (Human))
BDBM50399192
(CHEMBL2180156)
Show SMILES CC(C)[C@@H]1CC[C@@H](C)C[C@H]1OCC(=O)Nc1ccccc1OCCBr |r|
Show InChI InChI=1S/C20H30BrNO3/c1-14(2)16-9-8-15(3)12-19(16)25-13-20(23)22-17-6-4-5-7-18(17)24-11-10-21/h4-7,14-16,19H,8-13H2,1-3H3,(H,22,23)/t15-,16+,19-/m1/s1
n/an/a>1.00E+4n/an/an/an/an/an/a
University of Bonn
Curated by ChEMBL
Assay Description
Antagonist activity at human P2X4 receptor expressed in 1321N1 cells assessed as inhibition of ATP-induced cytosolic calcium influx compound preincub...
J Med Chem 55: 9576-88 (2012)
Article DOI: 10.1021/jm300845v
BindingDB Entry DOI: 10.7270/Q2XK8GPN