BDBM50399194 CHEMBL2180154
SMILES: O=C(N1CCOc2ccccc12)c1ccccc1
InChI Key: InChIKey=NEFCBSJRCDKHRX-UHFFFAOYSA-N
Data: 1 IC50
Activity Spreadsheet -- Enzyme Inhibition Constant Data from BindingDB
Found 1 hit for monomerid = 50399194
Trg + Lig
Ki
nM
ΔG°
kcal/mole
IC50
nM
Kd
nM
EC50/IC50
nM
koff
s-1
kon
M-1s-1
pHTemp
°C
P2X purinoceptor 4
(Homo sapiens (Human))
BDBM50399194
(CHEMBL2180154)
Show SMILES O=C(N1CCOc2ccccc12)c1ccccc1
Show InChI InChI=1S/C15H13NO2/c17-15(12-6-2-1-3-7-12)16-10-11-18-14-9-5-4-8-13(14)16/h1-9H,10-11H2
n/an/a>1.00E+4n/an/an/an/an/an/a
University of Bonn
Curated by ChEMBL
Assay Description
Antagonist activity at human P2X4 receptor expressed in 1321N1 cells assessed as inhibition of ATP-induced cytosolic calcium influx compound preincub...
J Med Chem 55: 9576-88 (2012)
Article DOI: 10.1021/jm300845v
BindingDB Entry DOI: 10.7270/Q2XK8GPN