BDBM50399195 CHEMBL2180153
SMILES: O=C(N1CCOCC1)N1CCOc2ccccc12
InChI Key: InChIKey=JWWOBKWCFHEEJY-UHFFFAOYSA-N
Data: 1 IC50
Activity Spreadsheet -- Enzyme Inhibition Constant Data from BindingDB
Found 1 hit for monomerid = 50399195
Trg + Lig
Ki
nM
ΔG°
kcal/mole
IC50
nM
Kd
nM
EC50/IC50
nM
koff
s-1
kon
M-1s-1
pHTemp
°C
P2X purinoceptor 4
(Homo sapiens (Human))
BDBM50399195
(CHEMBL2180153)
Show SMILES O=C(N1CCOCC1)N1CCOc2ccccc12
Show InChI InChI=1S/C13H16N2O3/c16-13(14-5-8-17-9-6-14)15-7-10-18-12-4-2-1-3-11(12)15/h1-4H,5-10H2
n/an/a>1.00E+4n/an/an/an/an/an/a
University of Bonn
Curated by ChEMBL
Assay Description
Antagonist activity at human P2X4 receptor expressed in 1321N1 cells assessed as inhibition of ATP-induced cytosolic calcium influx compound preincub...
J Med Chem 55: 9576-88 (2012)
Article DOI: 10.1021/jm300845v
BindingDB Entry DOI: 10.7270/Q2XK8GPN