BDBM50399203 CHEMBL451082
SMILES: O=c1c2ccccc2n(Cc2ccccc2)c2ccccc12
InChI Key: InChIKey=HPZWRMSWPVJWGN-UHFFFAOYSA-N
Data: 1 IC50
Activity Spreadsheet -- Enzyme Inhibition Constant Data from BindingDB
Found 1 hit for monomerid = 50399203
Trg + Lig
Ki
nM
ΔG°
kcal/mole
IC50
nM
Kd
nM
EC50/IC50
nM
koff
s-1
kon
M-1s-1
pHTemp
°C
P2X purinoceptor 4
(Homo sapiens (Human))
BDBM50399203
(CHEMBL451082)
Show SMILES O=c1c2ccccc2n(Cc2ccccc2)c2ccccc12
Show InChI InChI=1S/C20H15NO/c22-20-16-10-4-6-12-18(16)21(14-15-8-2-1-3-9-15)19-13-7-5-11-17(19)20/h1-13H,14H2
n/an/a 5.97E+3n/an/an/an/an/an/a
University of Bonn
Curated by ChEMBL
Assay Description
Antagonist activity at human P2X4 receptor expressed in 1321N1 cells assessed as inhibition of ATP-induced cytosolic calcium influx compound preincub...
J Med Chem 55: 9576-88 (2012)
Article DOI: 10.1021/jm300845v
BindingDB Entry DOI: 10.7270/Q2XK8GPN