BDBM50399289 CHEMBL2180835
SMILES: COc1ccc(cc1)-c1cc(NC(=O)CCCN2CCCCC2)[nH]n1
InChI Key: InChIKey=OUTWSZAPEGAWEL-UHFFFAOYSA-N
Data: 3 IC50  1 EC50
Activity Spreadsheet -- Enzyme Inhibition Constant Data from BindingDB
Found 4 hits for monomerid = 50399289
Trg + Lig
Ki
nM
ΔG°
kcal/mole
IC50
nM
Kd
nM
EC50/IC50
nM
koff
s-1
kon
M-1s-1
pHTemp
°C
Cholinergic, Nicotinic Alpha3Beta2
(Homo sapiens (Human))
BDBM50399289
(CHEMBL2180835)
Show SMILES COc1ccc(cc1)-c1cc(NC(=O)CCCN2CCCCC2)[nH]n1
Show InChI InChI=1S/C19H26N4O2/c1-25-16-9-7-15(8-10-16)17-14-18(22-21-17)20-19(24)6-5-13-23-11-3-2-4-12-23/h7-10,14H,2-6,11-13H2,1H3,(H2,20,21,22,24)
n/an/a>3.16E+4n/an/an/an/an/an/a
Siena Biotech SpA
Curated by ChEMBL
Assay Description
Agonist activity at alpha3 nAchR in human SH-SY5Y cells assessed as stimulation of calcium flux by FLIPR
J Med Chem 55: 10277-81 (2012)
Article DOI: 10.1021/jm3013568
BindingDB Entry DOI: 10.7270/Q2DJ5GRD
Potassium voltage-gated channel subfamily H member 2
(Homo sapiens (Human))
BDBM50399289
(CHEMBL2180835)
Show SMILES COc1ccc(cc1)-c1cc(NC(=O)CCCN2CCCCC2)[nH]n1
Show InChI InChI=1S/C19H26N4O2/c1-25-16-9-7-15(8-10-16)17-14-18(22-21-17)20-19(24)6-5-13-23-11-3-2-4-12-23/h7-10,14H,2-6,11-13H2,1H3,(H2,20,21,22,24)
Reactome pathway
n/an/a 4.61E+3n/an/an/an/an/an/a
Siena Biotech SpA
Curated by ChEMBL
Assay Description
Inhibition of human ERG expressed in CHO cells
J Med Chem 55: 10277-81 (2012)
Article DOI: 10.1021/jm3013568
BindingDB Entry DOI: 10.7270/Q2DJ5GRD
Neuronal acetylcholine receptor
(Rattus norvegicus (Rat))
BDBM50399289
(CHEMBL2180835)
Show SMILES COc1ccc(cc1)-c1cc(NC(=O)CCCN2CCCCC2)[nH]n1
Show InChI InChI=1S/C19H26N4O2/c1-25-16-9-7-15(8-10-16)17-14-18(22-21-17)20-19(24)6-5-13-23-11-3-2-4-12-23/h7-10,14H,2-6,11-13H2,1H3,(H2,20,21,22,24)
Reactome pathway
n/an/an/an/a 417n/an/an/an/a
Siena Biotech SpA
Curated by ChEMBL
Assay Description
Agonist activity at rat alpha7 nAchR expressed in rat GH4C1 cells assessed as stimulation of calcium flux by FLIPR
J Med Chem 55: 10277-81 (2012)
Article DOI: 10.1021/jm3013568
BindingDB Entry DOI: 10.7270/Q2DJ5GRD
5-hydroxytryptamine receptor 3A
(Homo sapiens (Human))
BDBM50399289
(CHEMBL2180835)
Show SMILES COc1ccc(cc1)-c1cc(NC(=O)CCCN2CCCCC2)[nH]n1
Show InChI InChI=1S/C19H26N4O2/c1-25-16-9-7-15(8-10-16)17-14-18(22-21-17)20-19(24)6-5-13-23-11-3-2-4-12-23/h7-10,14H,2-6,11-13H2,1H3,(H2,20,21,22,24)
Reactome pathway
n/an/a>3.16E+4n/an/an/an/an/an/a
Siena Biotech SpA
Curated by ChEMBL
Assay Description
Agonist activity at human 5HT3R expressed in HEK293 cells assessed as stimulation of calcium flux by FLIPR
J Med Chem 55: 10277-81 (2012)
Article DOI: 10.1021/jm3013568
BindingDB Entry DOI: 10.7270/Q2DJ5GRD