BDBM50399303 CHEMBL2180844
SMILES: Oc1cccnc1NC(=O)Nc1cccc2C(=O)N3CCCCC3c12
InChI Key: InChIKey=FYBVVRIGUJAAOT-UHFFFAOYSA-N
Data: 2 IC50
Activity Spreadsheet -- Enzyme Inhibition Constant Data from BindingDB
Found 2 hits for monomerid = 50399303
Trg + Lig
Ki
nM
ΔG°
kcal/mole
IC50
nM
Kd
nM
EC50/IC50
nM
koff
s-1
kon
M-1s-1
pHTemp
°C
Dual-specificity tyrosine-phosphorylation regulated kinase 1A
(Homo sapiens (Human))
BDBM50399303
(CHEMBL2180844)
Show SMILES Oc1cccnc1NC(=O)Nc1cccc2C(=O)N3CCCCC3c12
Show InChI InChI=1S/C18H18N4O3/c23-14-8-4-9-19-16(14)21-18(25)20-12-6-3-5-11-15(12)13-7-1-2-10-22(13)17(11)24/h3-6,8-9,13,23H,1-2,7,10H2,(H2,19,20,21,25)
Reactome pathway
n/an/a 1.80E+3n/an/an/an/an/an/a
Universit£ d'Orl£ans
Curated by ChEMBL
Assay Description
Inhibition of human recombinant GST-fused DYRK1A expressed in Escherichia coli using KKISGRLSPIMTEQ as substrate and [gamma-33P]-ATP after 30 mins by...
J Med Chem 55: 9589-606 (2012)
Article DOI: 10.1021/jm3008536
BindingDB Entry DOI: 10.7270/Q28S4R2J
Cyclin-Dependent Kinase 5 (CDK5)
(Homo sapiens (Human))
BDBM50399303
(CHEMBL2180844)
Show SMILES Oc1cccnc1NC(=O)Nc1cccc2C(=O)N3CCCCC3c12
Show InChI InChI=1S/C18H18N4O3/c23-14-8-4-9-19-16(14)21-18(25)20-12-6-3-5-11-15(12)13-7-1-2-10-22(13)17(11)24/h3-6,8-9,13,23H,1-2,7,10H2,(H2,19,20,21,25)
NCI pathway
Reactome pathway
n/an/a 37n/an/an/an/an/an/a
Universit£ d'Orl£ans
Curated by ChEMBL
Assay Description
Inhibition of human recombinant CDK5/p25 using histone H1 as substrate and [gamma-33P]-ATP after 30 mins by scintillation counting
J Med Chem 55: 9589-606 (2012)
Article DOI: 10.1021/jm3008536
BindingDB Entry DOI: 10.7270/Q28S4R2J