BDBM50399380 CHEMBL2177648
SMILES: CN(C)[C@H]1CCN(Cc2ccc(NC(=O)c3ccc(C)c(c3)-n3cc(nn3)-c3cnc4[nH]ncc4c3)cc2C(F)(F)F)C1
InChI Key: InChIKey=WKTHEPAGRCQCOF-DEOSSOPVSA-N
Data: 1 IC50
Activity Spreadsheet -- Enzyme Inhibition Constant Data from BindingDB
Found 1 hit for monomerid = 50399380
Trg + Lig
Ki
nM
ΔG°
kcal/mole
IC50
nM
Kd
nM
EC50/IC50
nM
koff
s-1
kon
M-1s-1
pHTemp
°C
Bcr-Abl
(Homo sapiens (Human))
BDBM50399380
(CHEMBL2177648)
Show SMILES CN(C)[C@H]1CCN(Cc2ccc(NC(=O)c3ccc(C)c(c3)-n3cc(nn3)-c3cnc4[nH]ncc4c3)cc2C(F)(F)F)C1 |r|
Show InChI InChI=1S/C30H30F3N9O/c1-18-4-5-19(11-27(18)42-17-26(37-39-42)21-10-22-14-35-38-28(22)34-13-21)29(43)36-23-7-6-20(25(12-23)30(31,32)33)15-41-9-8-24(16-41)40(2)3/h4-7,10-14,17,24H,8-9,15-16H2,1-3H3,(H,36,43)(H,34,35,38)/t24-/m0/s1
NCI pathway
Reactome pathway
n/an/a 0.520n/an/an/an/an/an/a
Chinese Academy of Sciences
Curated by ChEMBL
Assay Description
Inhibition of wild type Bcr-Abl using Tyr2 peptide as substrate after 2 hrs by FRET-based Z'-Lyte assay
J Med Chem 55: 10033-46 (2012)
Article DOI: 10.1021/jm301188x
BindingDB Entry DOI: 10.7270/Q2N29Z23