BDBM50399398 CHEMBL2177630
SMILES: CN1CCN(Cc2ccc(NC(=O)c3ccc(C)c(c3)-n3cc(nn3)-c3cnc4ncccn34)cc2C(F)(F)F)CC1
InChI Key: InChIKey=HXVYZZYPRMCJGZ-UHFFFAOYSA-N
Data: 1 IC50
Activity Spreadsheet -- Enzyme Inhibition Constant Data from BindingDB
Found 1 hit for monomerid = 50399398
Trg + Lig
Ki
nM
ΔG°
kcal/mole
IC50
nM
Kd
nM
EC50/IC50
nM
koff
s-1
kon
M-1s-1
pHTemp
°C
Bcr-Abl
(Homo sapiens (Human))
BDBM50399398
(CHEMBL2177630)
Show SMILES CN1CCN(Cc2ccc(NC(=O)c3ccc(C)c(c3)-n3cc(nn3)-c3cnc4ncccn34)cc2C(F)(F)F)CC1
Show InChI InChI=1S/C29H28F3N9O/c1-19-4-5-20(14-25(19)41-18-24(36-37-41)26-16-34-28-33-8-3-9-40(26)28)27(42)35-22-7-6-21(23(15-22)29(30,31)32)17-39-12-10-38(2)11-13-39/h3-9,14-16,18H,10-13,17H2,1-2H3,(H,35,42)
NCI pathway
Reactome pathway
n/an/a 3.44n/an/an/an/an/an/a
Chinese Academy of Sciences
Curated by ChEMBL
Assay Description
Inhibition of wild type Bcr-Abl using Tyr2 peptide as substrate after 2 hrs by FRET-based Z'-Lyte assay
J Med Chem 55: 10033-46 (2012)
Article DOI: 10.1021/jm301188x
BindingDB Entry DOI: 10.7270/Q2N29Z23