null
SMILES: CCc1cc(O)c(Oc2ccccc2F)cc1F
InChI Key: InChIKey=MUHZCNPYLSMOCX-UHFFFAOYSA-N
PDB links: 1 PDB ID matches this monomer.
Activity Spreadsheet -- Enzyme Inhibition Constant Data from BindingDB
Found 2 hits for monomerid = 50399411
Trg + Lig
Ki
nM
ΔG°
kcal/mole
IC50
nM
Kd
nM
EC50/IC50
nM
koff
s-1
kon
M-1s-1
pHTemp
°C
Enoyl-[acyl-carrier-protein] reductase [NADH]
(Burkholderia pseudomallei)
BDBM50399411
(CHEMBL2178304 | PT405)
Show SMILES CCc1cc(O)c(Oc2ccccc2F)cc1F
Show InChI InChI=1S/C14H12F2O2/c1-2-9-7-12(17)14(8-11(9)16)18-13-6-4-3-5-10(13)15/h3-8,17H,2H2,1H3
4 -11.4n/an/an/an/an/a8.025
Stony Brook University
Assay Description
Slow-onset inhibition kinetics were monitored at 340 nm on a Cary 100 spectrophotometer (Varian) at 25 °C in 30 mM PIPES buffer (pH 8.0) containing 1...
Biochemistry 56: 1865-1878 (2017)
Article DOI: 10.1021/acs.biochem.6b01048
BindingDB Entry DOI: 10.7270/Q2NP239F
Enoyl-[acyl-carrier-protein] reductase [NADPH] FabI
(Staphylococcus aureus)
BDBM50399411
(CHEMBL2178304 | PT405)
Show SMILES CCc1cc(O)c(Oc2ccccc2F)cc1F
Show InChI InChI=1S/C14H12F2O2/c1-2-9-7-12(17)14(8-11(9)16)18-13-6-4-3-5-10(13)15/h3-8,17H,2H2,1H3
n/an/a 8n/an/an/an/an/an/a
Mutabilis
Curated by ChEMBL
Assay Description
Inhibition of Staphylococcus aureus recombinant FabI using trans-2-octenoyl N-acetylcysteamine thioester as substrate preincubated for 60 mins
J Med Chem 55: 9914-28 (2012)
Article DOI: 10.1021/jm301113w
BindingDB Entry DOI: 10.7270/Q2H99699