BDBM50399415 CHEMBL2178872
SMILES: FC(F)(F)CCc1cc(on1)-c1cncc(OC[C@@H]2CCN2)c1
InChI Key: InChIKey=PUCADISPXQCOJH-LBPRGKRZSA-N
Data: 2 IC50  2 EC50
Activity Spreadsheet -- Enzyme Inhibition Constant Data from BindingDB
Found 4 hits for monomerid = 50399415
Trg + Lig
Ki
nM
ΔG°
kcal/mole
IC50
nM
Kd
nM
EC50/IC50
nM
koff
s-1
kon
M-1s-1
pHTemp
°C
Neuronal acetylcholine receptor Alpha-4/Beta-2
(Homo sapiens (Human))
BDBM50399415
(CHEMBL2178872)
Show SMILES FC(F)(F)CCc1cc(on1)-c1cncc(OC[C@@H]2CCN2)c1 |r|
Show InChI InChI=1S/C15H16F3N3O2/c16-15(17,18)3-1-11-6-14(23-21-11)10-5-13(8-19-7-10)22-9-12-2-4-20-12/h5-8,12,20H,1-4,9H2/t12-/m0/s1
NCI pathway
Reactome pathway
n/an/a 83n/an/an/an/an/an/a
University of Illinois at Chicago
Curated by ChEMBL
Assay Description
Antagonist activity at human alpha4beta2 nAChR expressed in human SH-EP1 cells assessed as inhibition of 86Rb+ efflux preincubated for 10 mins by liq...
J Med Chem 55: 9998-10009 (2012)
Article DOI: 10.1021/jm301177j
BindingDB Entry DOI: 10.7270/Q2CJ8FM1
Neuronal acetylcholine receptor Alpha-4/Beta-2
(Homo sapiens (Human))
BDBM50399415
(CHEMBL2178872)
Show SMILES FC(F)(F)CCc1cc(on1)-c1cncc(OC[C@@H]2CCN2)c1 |r|
Show InChI InChI=1S/C15H16F3N3O2/c16-15(17,18)3-1-11-6-14(23-21-11)10-5-13(8-19-7-10)22-9-12-2-4-20-12/h5-8,12,20H,1-4,9H2/t12-/m0/s1
NCI pathway
Reactome pathway
n/an/an/an/a 54n/an/an/an/a
University of Illinois at Chicago
Curated by ChEMBL
Assay Description
Agonist activity at human alpha4beta2 nAChR expressed in human SH-EP1 cells assessed as stimulation of 86Rb+ efflux preincubated for 10 mins by liqui...
J Med Chem 55: 9998-10009 (2012)
Article DOI: 10.1021/jm301177j
BindingDB Entry DOI: 10.7270/Q2CJ8FM1
Neuronal acetylcholine receptor Alpha-4/Beta-2
(Homo sapiens (Human))
BDBM50399415
(CHEMBL2178872)
Show SMILES FC(F)(F)CCc1cc(on1)-c1cncc(OC[C@@H]2CCN2)c1 |r|
Show InChI InChI=1S/C15H16F3N3O2/c16-15(17,18)3-1-11-6-14(23-21-11)10-5-13(8-19-7-10)22-9-12-2-4-20-12/h5-8,12,20H,1-4,9H2/t12-/m0/s1
NCI pathway
Reactome pathway
n/an/an/an/a 53.7n/an/an/an/a
University of Illinois at Chicago
Curated by ChEMBL
Assay Description
Agonist activity at human alpha4beta2 nAChR expressed in human SH-EP1 cells assessed as stimulation of 86Rb+ efflux preincubated for 10 mins by liqui...
J Med Chem 55: 9998-10009 (2012)
Article DOI: 10.1021/jm301177j
BindingDB Entry DOI: 10.7270/Q2CJ8FM1
Neuronal acetylcholine receptor Alpha-4/Beta-2
(Homo sapiens (Human))
BDBM50399415
(CHEMBL2178872)
Show SMILES FC(F)(F)CCc1cc(on1)-c1cncc(OC[C@@H]2CCN2)c1 |r|
Show InChI InChI=1S/C15H16F3N3O2/c16-15(17,18)3-1-11-6-14(23-21-11)10-5-13(8-19-7-10)22-9-12-2-4-20-12/h5-8,12,20H,1-4,9H2/t12-/m0/s1
NCI pathway
Reactome pathway
n/an/a 83.2n/an/an/an/an/an/a
University of Illinois at Chicago
Curated by ChEMBL
Assay Description
Antagonist activity at human alpha4beta2 nAChR expressed in human SH-EP1 cells assessed as inhibition of 86Rb+ efflux preincubated for 10 mins by liq...
J Med Chem 55: 9998-10009 (2012)
Article DOI: 10.1021/jm301177j
BindingDB Entry DOI: 10.7270/Q2CJ8FM1