BDBM50399424 CHEMBL2178330
SMILES: CN1CCC[C@H]1COc1cncc(c1)-c1cc(CCO)no1
InChI Key: InChIKey=CEVPPNAINXEGSH-AWEZNQCLSA-N
Data: 2 IC50  2 EC50
Activity Spreadsheet -- Enzyme Inhibition Constant Data from BindingDB
Found 4 hits for monomerid = 50399424
Trg + Lig
Ki
nM
ΔG°
kcal/mole
IC50
nM
Kd
nM
EC50/IC50
nM
koff
s-1
kon
M-1s-1
pHTemp
°C
Neuronal acetylcholine receptor Alpha-4/Beta-2
(Homo sapiens (Human))
BDBM50399424
(CHEMBL2178330)
Show SMILES CN1CCC[C@H]1COc1cncc(c1)-c1cc(CCO)no1 |r|
Show InChI InChI=1S/C16H21N3O3/c1-19-5-2-3-14(19)11-21-15-7-12(9-17-10-15)16-8-13(4-6-20)18-22-16/h7-10,14,20H,2-6,11H2,1H3/t14-/m0/s1
NCI pathway
Reactome pathway
n/an/a 110n/an/an/an/an/an/a
University of Illinois at Chicago
Curated by ChEMBL
Assay Description
Antagonist activity at human alpha4beta2 nAChR expressed in human SH-EP1 cells assessed as inhibition of 86Rb+ efflux preincubated for 10 mins by liq...
J Med Chem 55: 9998-10009 (2012)
Article DOI: 10.1021/jm301177j
BindingDB Entry DOI: 10.7270/Q2CJ8FM1
Neuronal acetylcholine receptor Alpha-4/Beta-2
(Homo sapiens (Human))
BDBM50399424
(CHEMBL2178330)
Show SMILES CN1CCC[C@H]1COc1cncc(c1)-c1cc(CCO)no1 |r|
Show InChI InChI=1S/C16H21N3O3/c1-19-5-2-3-14(19)11-21-15-7-12(9-17-10-15)16-8-13(4-6-20)18-22-16/h7-10,14,20H,2-6,11H2,1H3/t14-/m0/s1
NCI pathway
Reactome pathway
n/an/an/an/a 98n/an/an/an/a
University of Illinois at Chicago
Curated by ChEMBL
Assay Description
Agonist activity at human alpha4beta2 nAChR expressed in human SH-EP1 cells assessed as stimulation of 86Rb+ efflux preincubated for 10 mins by liqui...
J Med Chem 55: 9998-10009 (2012)
Article DOI: 10.1021/jm301177j
BindingDB Entry DOI: 10.7270/Q2CJ8FM1
Neuronal acetylcholine receptor Alpha-4/Beta-2
(Homo sapiens (Human))
BDBM50399424
(CHEMBL2178330)
Show SMILES CN1CCC[C@H]1COc1cncc(c1)-c1cc(CCO)no1 |r|
Show InChI InChI=1S/C16H21N3O3/c1-19-5-2-3-14(19)11-21-15-7-12(9-17-10-15)16-8-13(4-6-20)18-22-16/h7-10,14,20H,2-6,11H2,1H3/t14-/m0/s1
NCI pathway
Reactome pathway
n/an/a 110n/an/an/an/an/an/a
University of Illinois at Chicago
Curated by ChEMBL
Assay Description
Antagonist activity at human alpha4beta2 nAChR expressed in human SH-EP1 cells assessed as inhibition of 86Rb+ efflux preincubated for 10 mins by liq...
J Med Chem 55: 9998-10009 (2012)
Article DOI: 10.1021/jm301177j
BindingDB Entry DOI: 10.7270/Q2CJ8FM1
Neuronal acetylcholine receptor Alpha-4/Beta-2
(Homo sapiens (Human))
BDBM50399424
(CHEMBL2178330)
Show SMILES CN1CCC[C@H]1COc1cncc(c1)-c1cc(CCO)no1 |r|
Show InChI InChI=1S/C16H21N3O3/c1-19-5-2-3-14(19)11-21-15-7-12(9-17-10-15)16-8-13(4-6-20)18-22-16/h7-10,14,20H,2-6,11H2,1H3/t14-/m0/s1
NCI pathway
Reactome pathway
n/an/an/an/a 97.7n/an/an/an/a
University of Illinois at Chicago
Curated by ChEMBL
Assay Description
Agonist activity at human alpha4beta2 nAChR expressed in human SH-EP1 cells assessed as stimulation of 86Rb+ efflux preincubated for 10 mins by liqui...
J Med Chem 55: 9998-10009 (2012)
Article DOI: 10.1021/jm301177j
BindingDB Entry DOI: 10.7270/Q2CJ8FM1