BDBM50399444 CHEMBL2179384
SMILES: CN1Cc2cc(ccc2NC1=O)S(=O)(=O)Nc1ccccc1
InChI Key: InChIKey=MUQCGKPYCUDNMX-UHFFFAOYSA-N
Data: 1 IC50
PDB links: 1 PDB ID matches this monomer.
Activity Spreadsheet -- Enzyme Inhibition Constant Data from BindingDB
Found 1 hit for monomerid = 50399444
Trg + Lig
Ki
nM
ΔG°
kcal/mole
IC50
nM
Kd
nM
EC50/IC50
nM
koff
s-1
kon
M-1s-1
pHTemp
°C
Bromodomain-containing protein 4
(Homo sapiens (Human))
BDBM50399444
(CHEMBL2179384)
Show SMILES CN1Cc2cc(ccc2NC1=O)S(=O)(=O)Nc1ccccc1
Show InChI InChI=1S/C15H15N3O3S/c1-18-10-11-9-13(7-8-14(11)16-15(18)19)22(20,21)17-12-5-3-2-4-6-12/h2-9,17H,10H2,1H3,(H,16,19)
n/an/a 4.40E+3n/an/an/an/an/an/a
Pfizer Inc.
Curated by ChEMBL
Assay Description
Inhibition of BRD4 isoform 1 by AlphaScreen assay
J Med Chem 55: 9831-7 (2012)
Article DOI: 10.1021/jm3010515
BindingDB Entry DOI: 10.7270/Q20C4WXS
3D
3D Structure (crystal)