BDBM50399446 CHEMBL2179382
SMILES: CN1Cc2cc(ccc2NC1=O)S(=O)(=O)N1CCCC1
InChI Key: InChIKey=JPBCSPCBFLTTPI-UHFFFAOYSA-N
Data: 1 IC50
PDB links: 1 PDB ID matches this monomer.
Activity Spreadsheet -- Enzyme Inhibition Constant Data from BindingDB
Found 1 hit for monomerid = 50399446
Trg + Lig
Ki
nM
ΔG°
kcal/mole
IC50
nM
Kd
nM
EC50/IC50
nM
koff
s-1
kon
M-1s-1
pHTemp
°C
Bromodomain-containing protein 4
(Homo sapiens (Human))
BDBM50399446
(CHEMBL2179382)
Show SMILES CN1Cc2cc(ccc2NC1=O)S(=O)(=O)N1CCCC1
Show InChI InChI=1S/C13H17N3O3S/c1-15-9-10-8-11(4-5-12(10)14-13(15)17)20(18,19)16-6-2-3-7-16/h4-5,8H,2-3,6-7,9H2,1H3,(H,14,17)
n/an/a 4.80E+3n/an/an/an/an/an/a
Pfizer Inc.
Curated by ChEMBL
Assay Description
Inhibition of BRD4 isoform 1 by AlphaScreen assay
J Med Chem 55: 9831-7 (2012)
Article DOI: 10.1021/jm3010515
BindingDB Entry DOI: 10.7270/Q20C4WXS
3D
3D Structure (crystal)