null
SMILES: ONC(=O)c1cccc(c1)-c1cn(CCc2ccccc2)nn1
InChI Key: InChIKey=HWLOIPFPGVBJBC-UHFFFAOYSA-N
Activity Spreadsheet -- Enzyme Inhibition Constant Data from BindingDB
Found 5 hits for monomerid = 50399674
Trg + Lig
Ki
nM
ΔG°
kcal/mole
IC50
nM
Kd
nM
EC50/IC50
nM
koff
s-1
kon
M-1s-1
pHTemp
°C
Histone deacetylase 6
(Homo sapiens (Human))
BDBM50399674
(CHEMBL2178344)
Show SMILES ONC(=O)c1cccc(c1)-c1cn(CCc2ccccc2)nn1
Show InChI InChI=1S/C17H16N4O2/c22-17(19-23)15-8-4-7-14(11-15)16-12-21(20-18-16)10-9-13-5-2-1-3-6-13/h1-8,11-12,23H,9-10H2,(H,19,22)
NCI pathway
Reactome pathway
n/an/a 3.20E+3n/an/an/an/an/an/a
Kyoto Prefectural University of Medicine
Curated by ChEMBL
Assay Description
Inhibition of HDAC6 by fluorometric assay
J Med Chem 55: 9562-75 (2012)
Article DOI: 10.1021/jm300837y
BindingDB Entry DOI: 10.7270/Q25X2B3Q
Histone deacetylase 4
(Homo sapiens (Human))
BDBM50399674
(CHEMBL2178344)
Show SMILES ONC(=O)c1cccc(c1)-c1cn(CCc2ccccc2)nn1
Show InChI InChI=1S/C17H16N4O2/c22-17(19-23)15-8-4-7-14(11-15)16-12-21(20-18-16)10-9-13-5-2-1-3-6-13/h1-8,11-12,23H,9-10H2,(H,19,22)
n/an/a>1.00E+5n/an/an/an/an/an/a
Kyoto Prefectural University of Medicine
Curated by ChEMBL
Assay Description
Inhibition of HDAC4 by fluorometric assay
J Med Chem 55: 9562-75 (2012)
Article DOI: 10.1021/jm300837y
BindingDB Entry DOI: 10.7270/Q25X2B3Q
Histone deacetylase 1
(Homo sapiens (Human))
BDBM50399674
(CHEMBL2178344)
Show SMILES ONC(=O)c1cccc(c1)-c1cn(CCc2ccccc2)nn1
Show InChI InChI=1S/C17H16N4O2/c22-17(19-23)15-8-4-7-14(11-15)16-12-21(20-18-16)10-9-13-5-2-1-3-6-13/h1-8,11-12,23H,9-10H2,(H,19,22)
NCI pathway
Reactome pathway
n/an/a>1.00E+5n/an/an/an/an/an/a
Kyoto Prefectural University of Medicine
Curated by ChEMBL
Assay Description
Inhibition of HDAC1 by fluorometric assay
J Med Chem 55: 9562-75 (2012)
Article DOI: 10.1021/jm300837y
BindingDB Entry DOI: 10.7270/Q25X2B3Q
Histone deacetylase 2
(Homo sapiens (Human))
BDBM50399674
(CHEMBL2178344)
Show SMILES ONC(=O)c1cccc(c1)-c1cn(CCc2ccccc2)nn1
Show InChI InChI=1S/C17H16N4O2/c22-17(19-23)15-8-4-7-14(11-15)16-12-21(20-18-16)10-9-13-5-2-1-3-6-13/h1-8,11-12,23H,9-10H2,(H,19,22)
NCI pathway
Reactome pathway
n/an/a 7.60E+4n/an/an/an/an/an/a
Kyoto Prefectural University of Medicine
Curated by ChEMBL
Assay Description
Inhibition of HDAC2 by fluorometric assay
J Med Chem 55: 9562-75 (2012)
Article DOI: 10.1021/jm300837y
BindingDB Entry DOI: 10.7270/Q25X2B3Q
Histone deacetylase 8
(Homo sapiens (Human))
BDBM50399674
(CHEMBL2178344)
Show SMILES ONC(=O)c1cccc(c1)-c1cn(CCc2ccccc2)nn1
Show InChI InChI=1S/C17H16N4O2/c22-17(19-23)15-8-4-7-14(11-15)16-12-21(20-18-16)10-9-13-5-2-1-3-6-13/h1-8,11-12,23H,9-10H2,(H,19,22)
NCI pathway
Reactome pathway
n/an/a 180n/an/an/an/an/an/a
Kyoto Prefectural University of Medicine
Curated by ChEMBL
Assay Description
Inhibition of HDAC8 by fluorometric assay
J Med Chem 55: 9562-75 (2012)
Article DOI: 10.1021/jm300837y
BindingDB Entry DOI: 10.7270/Q25X2B3Q