BDBM50399921 CHEMBL2180985
SMILES: CC(=O)O[C@@H]1C2=C(C)[C@H](C[C@@](O)([C@@H](OC(=O)c3ccccc3)[C@@H]3[C@@]4(CO[C@@H]4C[C@H](O)[C@@]3(C)C1=O)OC(C)=O)C2(C)C)OC(=O)[C@H](OC(=O)CCC(=O)NCc1ccc(CN2[C@@H]3CNC(=O)[C@H](CC(O)=O)NC(=O)CNC(=O)[C@H](CCCN=C(N)N)NC(=O)C[C@H](NC3=O)C2=O)cc1)[C@@H](NC(=O)c1ccccc1)c1ccccc1
InChI Key: InChIKey=RNDRXNFFHJEMIZ-LTYRGGSKSA-N
Data: 2 IC50
Activity Spreadsheet -- Enzyme Inhibition Constant Data from BindingDB
Found 2 hits for monomerid = 50399921
Trg + Lig
Ki
nM
ΔG°
kcal/mole
IC50
nM
Kd
nM
EC50/IC50
nM
koff
s-1
kon
M-1s-1
pHTemp
°C
Integrin alpha-V/beta-3
(Homo sapiens (Human))
BDBM50399921
(CHEMBL2180985)
Show SMILES CC(=O)O[C@@H]1C2=C(C)[C@H](C[C@@](O)([C@@H](OC(=O)c3ccccc3)[C@@H]3[C@@]4(CO[C@@H]4C[C@H](O)[C@@]3(C)C1=O)OC(C)=O)C2(C)C)OC(=O)[C@H](OC(=O)CCC(=O)NCc1ccc(CN2[C@@H]3CNC(=O)[C@H](CC(O)=O)NC(=O)CNC(=O)[C@H](CCCN=C(N)N)NC(=O)C[C@H](NC3=O)C2=O)cc1)[C@@H](NC(=O)c1ccccc1)c1ccccc1 |r,wU:22.23,26.26,4.3,10.10,30.33,28.30,60.64,77.82,65.70,wD:97.105,12.12,8.45,23.37,44.49,89.94,c:5,(5.81,-4.11,;5.77,-2.57,;4.42,-1.84,;7.09,-1.78,;8.43,-2.49,;8.5,-5.53,;8.52,-7.06,;7.19,-7.85,;9.87,-7.83,;11.18,-7.03,;11.16,-5.5,;12.51,-6.24,;12.48,-4.71,;13.83,-5.45,;13.85,-7.01,;12.53,-7.77,;15.19,-7.74,;16.5,-6.94,;17.85,-7.69,;17.88,-9.24,;16.55,-10.03,;15.22,-9.28,;12.45,-3.18,;13.76,-2.38,;15.31,-2.35,;15.29,-.82,;13.74,-.82,;12.39,-.08,;11.06,-.89,;11.01,.66,;11.1,-2.43,;11.52,-3.89,;9.75,-1.69,;9.71,-.15,;14.18,-3.86,;15.53,-4.6,;16.86,-3.81,;15.55,-6.16,;9.82,-4.74,;9,-3.44,;10.56,-3.39,;9.88,-9.35,;8.56,-10.14,;7.23,-9.39,;8.58,-11.67,;9.92,-12.44,;11.25,-11.66,;11.24,-10.12,;12.59,-12.42,;13.92,-11.64,;15.26,-12.4,;15.27,-13.94,;16.59,-11.62,;17.92,-12.38,;19.25,-11.6,;20.59,-12.37,;21.92,-11.6,;21.91,-10.05,;23.23,-9.27,;24.57,-10.03,;24.58,-11.57,;23.25,-12.35,;23.25,-13.89,;24.59,-16.19,;23.26,-16.97,;25.93,-16.95,;25.94,-18.49,;24.61,-19.27,;23.27,-18.51,;24.61,-20.81,;27.26,-16.18,;28.6,-16.94,;28.6,-18.48,;29.93,-16.17,;29.92,-14.63,;31.25,-13.85,;32.59,-14.62,;31.24,-12.31,;32.57,-11.54,;32.57,-10,;33.9,-9.22,;33.89,-7.68,;35.22,-6.9,;35.21,-5.36,;36.56,-7.67,;29.91,-11.55,;29.9,-10.01,;31.23,-9.23,;28.56,-9.24,;27.23,-10.02,;27.24,-11.56,;25.91,-12.33,;25.92,-13.87,;25.89,-9.25,;25.88,-7.71,;20.56,-9.29,;19.24,-10.08,;7.25,-12.46,;5.91,-11.72,;4.59,-12.49,;4.62,-14.05,;3.26,-11.76,;3.24,-10.21,;1.89,-9.46,;.58,-10.26,;.6,-11.79,;1.94,-12.55,;7.28,-13.99,;8.63,-14.74,;8.65,-16.29,;7.32,-17.08,;5.98,-16.32,;5.96,-14.79,)|
Show InChI InChI=1S/C78H91N11O24/c1-40-52(34-78(107)66(112-72(105)47-21-14-9-15-22-47)64-76(6,53(92)33-54-77(64,39-108-54)113-42(3)91)65(99)62(109-41(2)90)60(40)75(78,4)5)110-73(106)63(61(45-17-10-7-11-18-45)88-67(100)46-19-12-8-13-20-46)111-59(98)29-28-55(93)82-35-43-24-26-44(27-25-43)38-89-51-36-83-69(102)49(32-58(96)97)86-57(95)37-84-68(101)48(23-16-30-81-74(79)80)85-56(94)31-50(71(89)104)87-70(51)103/h7-15,17-22,24-27,48-54,61-64,66,92,107H,16,23,28-39H2,1-6H3,(H,82,93)(H,83,102)(H,84,101)(H,85,94)(H,86,95)(H,87,103)(H,88,100)(H,96,97)(H4,79,80,81)/t48-,49-,50-,51+,52-,53-,54+,61-,62+,63+,64-,66-,76+,77-,78+/m0/s1
n/an/a 8.5n/an/an/an/an/an/a
Universit£ degli Studi di Milano
Curated by ChEMBL
Assay Description
Competitive inhibition of biotinylated vitronectin to integrin alphaVbeta3 receptor after 3 hrs by microplate reader analysis
J Med Chem 55: 10460-74 (2012)
Article DOI: 10.1021/jm301058f
BindingDB Entry DOI: 10.7270/Q2WD41Q5
Integrin alpha-V/beta-5
(Homo sapiens (Human))
BDBM50399921
(CHEMBL2180985)
Show SMILES CC(=O)O[C@@H]1C2=C(C)[C@H](C[C@@](O)([C@@H](OC(=O)c3ccccc3)[C@@H]3[C@@]4(CO[C@@H]4C[C@H](O)[C@@]3(C)C1=O)OC(C)=O)C2(C)C)OC(=O)[C@H](OC(=O)CCC(=O)NCc1ccc(CN2[C@@H]3CNC(=O)[C@H](CC(O)=O)NC(=O)CNC(=O)[C@H](CCCN=C(N)N)NC(=O)C[C@H](NC3=O)C2=O)cc1)[C@@H](NC(=O)c1ccccc1)c1ccccc1 |r,wU:22.23,26.26,4.3,10.10,30.33,28.30,60.64,77.82,65.70,wD:97.105,12.12,8.45,23.37,44.49,89.94,c:5,(5.81,-4.11,;5.77,-2.57,;4.42,-1.84,;7.09,-1.78,;8.43,-2.49,;8.5,-5.53,;8.52,-7.06,;7.19,-7.85,;9.87,-7.83,;11.18,-7.03,;11.16,-5.5,;12.51,-6.24,;12.48,-4.71,;13.83,-5.45,;13.85,-7.01,;12.53,-7.77,;15.19,-7.74,;16.5,-6.94,;17.85,-7.69,;17.88,-9.24,;16.55,-10.03,;15.22,-9.28,;12.45,-3.18,;13.76,-2.38,;15.31,-2.35,;15.29,-.82,;13.74,-.82,;12.39,-.08,;11.06,-.89,;11.01,.66,;11.1,-2.43,;11.52,-3.89,;9.75,-1.69,;9.71,-.15,;14.18,-3.86,;15.53,-4.6,;16.86,-3.81,;15.55,-6.16,;9.82,-4.74,;9,-3.44,;10.56,-3.39,;9.88,-9.35,;8.56,-10.14,;7.23,-9.39,;8.58,-11.67,;9.92,-12.44,;11.25,-11.66,;11.24,-10.12,;12.59,-12.42,;13.92,-11.64,;15.26,-12.4,;15.27,-13.94,;16.59,-11.62,;17.92,-12.38,;19.25,-11.6,;20.59,-12.37,;21.92,-11.6,;21.91,-10.05,;23.23,-9.27,;24.57,-10.03,;24.58,-11.57,;23.25,-12.35,;23.25,-13.89,;24.59,-16.19,;23.26,-16.97,;25.93,-16.95,;25.94,-18.49,;24.61,-19.27,;23.27,-18.51,;24.61,-20.81,;27.26,-16.18,;28.6,-16.94,;28.6,-18.48,;29.93,-16.17,;29.92,-14.63,;31.25,-13.85,;32.59,-14.62,;31.24,-12.31,;32.57,-11.54,;32.57,-10,;33.9,-9.22,;33.89,-7.68,;35.22,-6.9,;35.21,-5.36,;36.56,-7.67,;29.91,-11.55,;29.9,-10.01,;31.23,-9.23,;28.56,-9.24,;27.23,-10.02,;27.24,-11.56,;25.91,-12.33,;25.92,-13.87,;25.89,-9.25,;25.88,-7.71,;20.56,-9.29,;19.24,-10.08,;7.25,-12.46,;5.91,-11.72,;4.59,-12.49,;4.62,-14.05,;3.26,-11.76,;3.24,-10.21,;1.89,-9.46,;.58,-10.26,;.6,-11.79,;1.94,-12.55,;7.28,-13.99,;8.63,-14.74,;8.65,-16.29,;7.32,-17.08,;5.98,-16.32,;5.96,-14.79,)|
Show InChI InChI=1S/C78H91N11O24/c1-40-52(34-78(107)66(112-72(105)47-21-14-9-15-22-47)64-76(6,53(92)33-54-77(64,39-108-54)113-42(3)91)65(99)62(109-41(2)90)60(40)75(78,4)5)110-73(106)63(61(45-17-10-7-11-18-45)88-67(100)46-19-12-8-13-20-46)111-59(98)29-28-55(93)82-35-43-24-26-44(27-25-43)38-89-51-36-83-69(102)49(32-58(96)97)86-57(95)37-84-68(101)48(23-16-30-81-74(79)80)85-56(94)31-50(71(89)104)87-70(51)103/h7-15,17-22,24-27,48-54,61-64,66,92,107H,16,23,28-39H2,1-6H3,(H,82,93)(H,83,102)(H,84,101)(H,85,94)(H,86,95)(H,87,103)(H,88,100)(H,96,97)(H4,79,80,81)/t48-,49-,50-,51+,52-,53-,54+,61-,62+,63+,64-,66-,76+,77-,78+/m0/s1
NCI pathway
Reactome pathway
n/an/a 518n/an/an/an/an/an/a
Universit£ degli Studi di Milano
Curated by ChEMBL
Assay Description
Competitive inhibition of biotinylated vitronectin to integrin alphaVbeta5 receptor after 3 hrs by microplate reader analysis
J Med Chem 55: 10460-74 (2012)
Article DOI: 10.1021/jm301058f
BindingDB Entry DOI: 10.7270/Q2WD41Q5