BDBM50400222 TASIAMIDE B
SMILES: COC(=O)[C@@H]1CCCN1C(=O)[C@H](Cc1ccccc1)N(C)C(=O)[C@H](C)NC(=O)[C@H](CC(C)C)NC(=O)C[C@H](O)[C@H](Cc1ccccc1)NC(=O)[C@H](CCC(N)=O)N(C)C(=O)[C@@H](NC(=O)[C@H](C)O)C(C)C
InChI Key: InChIKey=WFMVRFNXMBGKEW-BGGOGDBVSA-N
Data: 3 IC50
Activity Spreadsheet -- Enzyme Inhibition Constant Data from BindingDB
Found 3 hits for monomerid = 50400222
Trg + Lig
Ki
nM
ΔG°
kcal/mole
IC50
nM
Kd
nM
EC50/IC50
nM
koff
s-1
kon
M-1s-1
pHTemp
°C
Beta-secretase 1
(Homo sapiens (Human))
BDBM50400222
(TASIAMIDE B)
Show SMILES COC(=O)[C@@H]1CCCN1C(=O)[C@H](Cc1ccccc1)N(C)C(=O)[C@H](C)NC(=O)[C@H](CC(C)C)NC(=O)C[C@H](O)[C@H](Cc1ccccc1)NC(=O)[C@H](CCC(N)=O)N(C)C(=O)[C@@H](NC(=O)[C@H](C)O)C(C)C |r|
Show InChI InChI=1S/C50H74N8O12/c1-29(2)25-36(45(64)52-31(5)47(66)57(8)39(27-34-19-14-11-15-20-34)48(67)58-24-16-21-38(58)50(69)70-9)53-42(62)28-40(60)35(26-33-17-12-10-13-18-33)54-46(65)37(22-23-41(51)61)56(7)49(68)43(30(3)4)55-44(63)32(6)59/h10-15,17-20,29-32,35-40,43,59-60H,16,21-28H2,1-9H3,(H2,51,61)(H,52,64)(H,53,62)(H,54,65)(H,55,63)/t31-,32-,35-,36-,37-,38-,39-,40-,43-/m0/s1
n/an/a 353n/an/an/an/an/an/a
University of Florida
Curated by ChEMBL
Assay Description
Inhibition of BACE1 by fluorescence assay
J Med Chem 55: 10749-65 (2012)
Article DOI: 10.1021/jm301630s
BindingDB Entry DOI: 10.7270/Q2TH8NVB
Cathepsin D
(Homo sapiens (Human))
BDBM50400222
(TASIAMIDE B)
Show SMILES COC(=O)[C@@H]1CCCN1C(=O)[C@H](Cc1ccccc1)N(C)C(=O)[C@H](C)NC(=O)[C@H](CC(C)C)NC(=O)C[C@H](O)[C@H](Cc1ccccc1)NC(=O)[C@H](CCC(N)=O)N(C)C(=O)[C@@H](NC(=O)[C@H](C)O)C(C)C |r|
Show InChI InChI=1S/C50H74N8O12/c1-29(2)25-36(45(64)52-31(5)47(66)57(8)39(27-34-19-14-11-15-20-34)48(67)58-24-16-21-38(58)50(69)70-9)53-42(62)28-40(60)35(26-33-17-12-10-13-18-33)54-46(65)37(22-23-41(51)61)56(7)49(68)43(30(3)4)55-44(63)32(6)59/h10-15,17-20,29-32,35-40,43,59-60H,16,21-28H2,1-9H3,(H2,51,61)(H,52,64)(H,53,62)(H,54,65)(H,55,63)/t31-,32-,35-,36-,37-,38-,39-,40-,43-/m0/s1
NCI pathway
Reactome pathway
n/an/a 251n/an/an/an/an/an/a
University of Florida
Curated by ChEMBL
Assay Description
Inhibition of cathepsin D by fluorescence assay
J Med Chem 55: 10749-65 (2012)
Article DOI: 10.1021/jm301630s
BindingDB Entry DOI: 10.7270/Q2TH8NVB
Cathepsin E
(Homo sapiens (Human))
BDBM50400222
(TASIAMIDE B)
Show SMILES COC(=O)[C@@H]1CCCN1C(=O)[C@H](Cc1ccccc1)N(C)C(=O)[C@H](C)NC(=O)[C@H](CC(C)C)NC(=O)C[C@H](O)[C@H](Cc1ccccc1)NC(=O)[C@H](CCC(N)=O)N(C)C(=O)[C@@H](NC(=O)[C@H](C)O)C(C)C |r|
Show InChI InChI=1S/C50H74N8O12/c1-29(2)25-36(45(64)52-31(5)47(66)57(8)39(27-34-19-14-11-15-20-34)48(67)58-24-16-21-38(58)50(69)70-9)53-42(62)28-40(60)35(26-33-17-12-10-13-18-33)54-46(65)37(22-23-41(51)61)56(7)49(68)43(30(3)4)55-44(63)32(6)59/h10-15,17-20,29-32,35-40,43,59-60H,16,21-28H2,1-9H3,(H2,51,61)(H,52,64)(H,53,62)(H,54,65)(H,55,63)/t31-,32-,35-,36-,37-,38-,39-,40-,43-/m0/s1
n/an/a 38n/an/an/an/an/an/a
University of Florida
Curated by ChEMBL
Assay Description
Inhibition of cathepsin E by fluorescence assay
J Med Chem 55: 10749-65 (2012)
Article DOI: 10.1021/jm301630s
BindingDB Entry DOI: 10.7270/Q2TH8NVB