BDBM50400254 CHEMBL2179911
SMILES: Cc1cccc2Nc3nc(ccc3CN(c12)S(=O)(=O)c1ccc(cc1)C(C)(C)C)C(F)(F)F
InChI Key: InChIKey=QAMJARGHRSHGEQ-UHFFFAOYSA-N
Data: 1 IC50  2 EC50
Activity Spreadsheet -- Enzyme Inhibition Constant Data from BindingDB
Found 3 hits for monomerid = 50400254
Trg + Lig
Ki
nM
ΔG°
kcal/mole
IC50
nM
Kd
nM
EC50/IC50
nM
koff
s-1
kon
M-1s-1
pHTemp
°C
Bombesin receptor subtype-3
(Mus musculus)
BDBM50400254
(CHEMBL2179911)
Show SMILES Cc1cccc2Nc3nc(ccc3CN(c12)S(=O)(=O)c1ccc(cc1)C(C)(C)C)C(F)(F)F
Show InChI InChI=1S/C24H24F3N3O2S/c1-15-6-5-7-19-21(15)30(14-16-8-13-20(24(25,26)27)29-22(16)28-19)33(31,32)18-11-9-17(10-12-18)23(2,3)4/h5-13H,14H2,1-4H3,(H,28,29)
n/an/an/an/a 120n/an/an/an/a
TBA
Curated by ChEMBL
Assay Description
Agonist activity at mouse BRS3 expressed in HEK293 cells expressing aequorin measured for 30 secs by bioluminescence assay
ACS Med Chem Lett 2: 933-937 (2011)
Article DOI: 10.1021/ml200207w
BindingDB Entry DOI: 10.7270/Q25Q4X77
BRS3
(Homo sapiens (Human))
BDBM50400254
(CHEMBL2179911)
Show SMILES Cc1cccc2Nc3nc(ccc3CN(c12)S(=O)(=O)c1ccc(cc1)C(C)(C)C)C(F)(F)F
Show InChI InChI=1S/C24H24F3N3O2S/c1-15-6-5-7-19-21(15)30(14-16-8-13-20(24(25,26)27)29-22(16)28-19)33(31,32)18-11-9-17(10-12-18)23(2,3)4/h5-13H,14H2,1-4H3,(H,28,29)
Reactome pathway
n/an/a 0.900n/an/an/an/an/an/a
TBA
Curated by ChEMBL
Assay Description
Displacement of [125I]-[D-Tyr6,beta-Ala11,Phe13,Nle14]-Bombesin(6-14) from human BRS3 expressed in CHO cells expressing NFAT after 2 hrs by liquid sc...
ACS Med Chem Lett 2: 933-937 (2011)
Article DOI: 10.1021/ml200207w
BindingDB Entry DOI: 10.7270/Q25Q4X77
BRS3
(Homo sapiens (Human))
BDBM50400254
(CHEMBL2179911)
Show SMILES Cc1cccc2Nc3nc(ccc3CN(c12)S(=O)(=O)c1ccc(cc1)C(C)(C)C)C(F)(F)F
Show InChI InChI=1S/C24H24F3N3O2S/c1-15-6-5-7-19-21(15)30(14-16-8-13-20(24(25,26)27)29-22(16)28-19)33(31,32)18-11-9-17(10-12-18)23(2,3)4/h5-13H,14H2,1-4H3,(H,28,29)
Reactome pathway
n/an/an/an/a 50n/an/an/an/a
TBA
Curated by ChEMBL
Assay Description
Agonist activity at human BRS3 expressed in HEK293 cells expressing aequorin measured for 30 secs by bioluminescence assay
ACS Med Chem Lett 2: 933-937 (2011)
Article DOI: 10.1021/ml200207w
BindingDB Entry DOI: 10.7270/Q25Q4X77