BDBM50400427 CHEMBL2178445
SMILES: Cc1c(OCc2ccc(cc2)-c2ccc(Cl)cc2)ccc2c(C)c(CCC(O)=O)c(=O)oc12
InChI Key: InChIKey=PAXAYRBRMNYPFP-UHFFFAOYSA-N
Data: 1 IC50
Activity Spreadsheet -- Enzyme Inhibition Constant Data from BindingDB
Found 1 hit for monomerid = 50400427
Trg + Lig
Ki
nM
ΔG°
kcal/mole
IC50
nM
Kd
nM
EC50/IC50
nM
koff
s-1
kon
M-1s-1
pHTemp
°C
Replicative DNA helicase
(Bacillus anthracis)
BDBM50400427
(CHEMBL2178445)
Show SMILES Cc1c(OCc2ccc(cc2)-c2ccc(Cl)cc2)ccc2c(C)c(CCC(O)=O)c(=O)oc12
Show InChI InChI=1S/C27H23ClO5/c1-16-22-11-13-24(17(2)26(22)33-27(31)23(16)12-14-25(29)30)32-15-18-3-5-19(6-4-18)20-7-9-21(28)10-8-20/h3-11,13H,12,14-15H2,1-2H3,(H,29,30)
n/an/a 1.50E+3n/an/an/an/an/an/a
Microbiotix Inc.
Curated by ChEMBL
Assay Description
Inhibition of Bacillus anthracis Sterne 34F2 replicative DNA helicase-mediated ATP-dependent dissociation of Hel-5'FAM:Hel-3'BHQ by FRET assay
J Med Chem 55: 10896-908 (2012)
Article DOI: 10.1021/jm300922h
BindingDB Entry DOI: 10.7270/Q2MS3TWV