BDBM50400433 CHEMBL2177808
SMILES: Cc1c(CCC(O)=O)c(=O)oc2cc(OCc3ccccc3-c3ccccc3)ccc12
InChI Key: InChIKey=BGTCTHFGFFJJOR-UHFFFAOYSA-N
Data: 1 IC50
Activity Spreadsheet -- Enzyme Inhibition Constant Data from BindingDB
Found 1 hit for monomerid = 50400433
Trg + Lig
Ki
nM
ΔG°
kcal/mole
IC50
nM
Kd
nM
EC50/IC50
nM
koff
s-1
kon
M-1s-1
pHTemp
°C
Replicative DNA helicase
(Bacillus anthracis)
BDBM50400433
(CHEMBL2177808)
Show SMILES Cc1c(CCC(O)=O)c(=O)oc2cc(OCc3ccccc3-c3ccccc3)ccc12
Show InChI InChI=1S/C26H22O5/c1-17-21-12-11-20(15-24(21)31-26(29)22(17)13-14-25(27)28)30-16-19-9-5-6-10-23(19)18-7-3-2-4-8-18/h2-12,15H,13-14,16H2,1H3,(H,27,28)
n/an/a 1.90E+4n/an/an/an/an/an/a
Microbiotix Inc.
Curated by ChEMBL
Assay Description
Inhibition of Bacillus anthracis Sterne 34F2 replicative DNA helicase-mediated ATP-dependent dissociation of Hel-5'FAM:Hel-3'BHQ by FRET assay
J Med Chem 55: 10896-908 (2012)
Article DOI: 10.1021/jm300922h
BindingDB Entry DOI: 10.7270/Q2MS3TWV