BDBM50400442 CHEMBL2178460
SMILES: Cc1c(OCc2ccccc2)ccc2c(C)c(CCC(O)=O)c(=O)oc12
InChI Key: InChIKey=NATYKOYUMSKHQE-UHFFFAOYSA-N
Data: 1 IC50
Activity Spreadsheet -- Enzyme Inhibition Constant Data from BindingDB
Found 1 hit for monomerid = 50400442
Trg + Lig
Ki
nM
ΔG°
kcal/mole
IC50
nM
Kd
nM
EC50/IC50
nM
koff
s-1
kon
M-1s-1
pHTemp
°C
Replicative DNA helicase
(Bacillus anthracis)
BDBM50400442
(CHEMBL2178460)
Show SMILES Cc1c(OCc2ccccc2)ccc2c(C)c(CCC(O)=O)c(=O)oc12
Show InChI InChI=1S/C21H20O5/c1-13-16-8-10-18(25-12-15-6-4-3-5-7-15)14(2)20(16)26-21(24)17(13)9-11-19(22)23/h3-8,10H,9,11-12H2,1-2H3,(H,22,23)
n/an/a 8.50E+4n/an/an/an/an/an/a
Microbiotix Inc.
Curated by ChEMBL
Assay Description
Inhibition of Bacillus anthracis Sterne 34F2 replicative DNA helicase-mediated ATP-dependent dissociation of Hel-5'FAM:Hel-3'BHQ by FRET assay
J Med Chem 55: 10896-908 (2012)
Article DOI: 10.1021/jm300922h
BindingDB Entry DOI: 10.7270/Q2MS3TWV