BDBM50400571 CHEMBL2206253
SMILES: CC[C@H](CO)Nc1nc(NCC2CC2)c2ncn(C(C)C)c2n1
InChI Key: InChIKey=YKVSELNZSIXKMV-GFCCVEGCSA-N
Data: 1 EC50
Activity Spreadsheet -- Enzyme Inhibition Constant Data from BindingDB
Found 1 hit for monomerid = 50400571
Trg + Lig
Ki
nM
ΔG°
kcal/mole
IC50
nM
Kd
nM
EC50/IC50
nM
koff
s-1
kon
M-1s-1
pHTemp
°C
Voltage-gated calcium channel subunit alpha Cav2.2
(Homo sapiens (Human))
BDBM50400571
(CHEMBL2206253)
Show SMILES CC[C@H](CO)Nc1nc(NCC2CC2)c2ncn(C(C)C)c2n1 |r|
Show InChI InChI=1S/C16H26N6O/c1-4-12(8-23)19-16-20-14(17-7-11-5-6-11)13-15(21-16)22(9-18-13)10(2)3/h9-12,23H,4-8H2,1-3H3,(H2,17,19,20,21)/t12-/m1/s1
n/an/an/an/a>1.00E+5n/an/an/an/a
TBA
Curated by ChEMBL
Assay Description
Agonist activity at N-type Cav2.2 channel expressed in tsA201 cell assessed as calcium current by whole-cell patch clamp method
ACS Med Chem Lett 3: 985-990 (2012)
Article DOI: 10.1021/ml3002083
BindingDB Entry DOI: 10.7270/Q2BC40P0