BDBM50400573 CHEMBL2206251
SMILES: CC[C@H](CO)Nc1nc(NCc2cccnc2)c2ncn(C)c2n1
InChI Key: InChIKey=OAEIXFAHSCLGRA-GFCCVEGCSA-N
Data: 1 EC50
Activity Spreadsheet -- Enzyme Inhibition Constant Data from BindingDB
Found 1 hit for monomerid = 50400573
Trg + Lig
Ki
nM
ΔG°
kcal/mole
IC50
nM
Kd
nM
EC50/IC50
nM
koff
s-1
kon
M-1s-1
pHTemp
°C
Voltage-gated calcium channel subunit alpha Cav2.2
(Homo sapiens (Human))
BDBM50400573
(CHEMBL2206251)
Show SMILES CC[C@H](CO)Nc1nc(NCc2cccnc2)c2ncn(C)c2n1 |r|
Show InChI InChI=1S/C16H21N7O/c1-3-12(9-24)20-16-21-14(13-15(22-16)23(2)10-19-13)18-8-11-5-4-6-17-7-11/h4-7,10,12,24H,3,8-9H2,1-2H3,(H2,18,20,21,22)/t12-/m1/s1
n/an/an/an/a>1.00E+5n/an/an/an/a
TBA
Curated by ChEMBL
Assay Description
Agonist activity at N-type Cav2.2 channel expressed in tsA201 cell assessed as calcium current by whole-cell patch clamp method
ACS Med Chem Lett 3: 985-990 (2012)
Article DOI: 10.1021/ml3002083
BindingDB Entry DOI: 10.7270/Q2BC40P0