BDBM50400610 CHEMBL2203432
SMILES: CCN1CCC(CC1)Oc1ccnc(c1)C(=O)Nc1ccc(NC(=O)Nc2cc(on2)C(C)(C)C)cc1
InChI Key: InChIKey=BAEPKCSJXVFDDR-UHFFFAOYSA-N
Data: 1 IC50  2 Kd
Activity Spreadsheet -- Enzyme Inhibition Constant Data from BindingDB
Found 3 hits for monomerid = 50400610
Trg + Lig
Ki
nM
ΔG°
kcal/mole
IC50
nM
Kd
nM
EC50/IC50
nM
koff
s-1
kon
M-1s-1
pHTemp
°C
Macrophage colony-stimulating factor 1 receptor (c-Fms)
(Mus musculus (Mouse))
BDBM50400610
(CHEMBL2203432)
Show SMILES CCN1CCC(CC1)Oc1ccnc(c1)C(=O)Nc1ccc(NC(=O)Nc2cc(on2)C(C)(C)C)cc1
Show InChI InChI=1S/C27H34N6O4/c1-5-33-14-11-20(12-15-33)36-21-10-13-28-22(16-21)25(34)29-18-6-8-19(9-7-18)30-26(35)31-24-17-23(37-32-24)27(2,3)4/h6-10,13,16-17,20H,5,11-12,14-15H2,1-4H3,(H,29,34)(H2,30,31,32,35)
n/an/a 296n/an/an/an/an/an/a
TBA
Curated by ChEMBL
Assay Description
Inhibition of CSF1R in mouse M-NFS-60 cells assessed as inhibition of cell proliferation after 72 hrs by Celltiter-Blue assay
ACS Med Chem Lett 3: 997-1002 (2012)
Article DOI: 10.1021/ml300214g
BindingDB Entry DOI: 10.7270/Q22V2H9V
Receptor-type tyrosine-protein kinase FLT3
(Homo sapiens (Human))
BDBM50400610
(CHEMBL2203432)
Show SMILES CCN1CCC(CC1)Oc1ccnc(c1)C(=O)Nc1ccc(NC(=O)Nc2cc(on2)C(C)(C)C)cc1
Show InChI InChI=1S/C27H34N6O4/c1-5-33-14-11-20(12-15-33)36-21-10-13-28-22(16-21)25(34)29-18-6-8-19(9-7-18)30-26(35)31-24-17-23(37-32-24)27(2,3)4/h6-10,13,16-17,20H,5,11-12,14-15H2,1-4H3,(H,29,34)(H2,30,31,32,35)
n/an/an/a 1n/an/an/an/an/a
TBA
Curated by ChEMBL
Assay Description
Binding affinity to FLT3 expressed in HEK-293 cells after 1 hr
ACS Med Chem Lett 3: 997-1002 (2012)
Article DOI: 10.1021/ml300214g
BindingDB Entry DOI: 10.7270/Q22V2H9V
Macrophage colony stimulating factor receptor
(Homo sapiens (Human))
BDBM50400610
(CHEMBL2203432)
Show SMILES CCN1CCC(CC1)Oc1ccnc(c1)C(=O)Nc1ccc(NC(=O)Nc2cc(on2)C(C)(C)C)cc1
Show InChI InChI=1S/C27H34N6O4/c1-5-33-14-11-20(12-15-33)36-21-10-13-28-22(16-21)25(34)29-18-6-8-19(9-7-18)30-26(35)31-24-17-23(37-32-24)27(2,3)4/h6-10,13,16-17,20H,5,11-12,14-15H2,1-4H3,(H,29,34)(H2,30,31,32,35)
n/an/an/a 3n/an/an/an/an/a
TBA
Curated by ChEMBL
Assay Description
Binding affinity to CSF1R expressed in HEK-293 cells after 1 hr
ACS Med Chem Lett 3: 997-1002 (2012)
Article DOI: 10.1021/ml300214g
BindingDB Entry DOI: 10.7270/Q22V2H9V