BDBM50400745 CHEMBL2203559
SMILES: COc1cnc(COc2ccc(F)cc2)nc1-c1cc2c(CCNC2=O)[nH]1
InChI Key: InChIKey=VGNSQEJXQARLLC-UHFFFAOYSA-N
Data: 4 IC50
Activity Spreadsheet -- Enzyme Inhibition Constant Data from BindingDB
Found 4 hits for monomerid = 50400745
Trg + Lig
Ki
nM
ΔG°
kcal/mole
IC50
nM
Kd
nM
EC50/IC50
nM
koff
s-1
kon
M-1s-1
pHTemp
°C
Casein kinase I isoform alpha
(Homo sapiens (Human))
BDBM50400745
(CHEMBL2203559)
Show SMILES COc1cnc(COc2ccc(F)cc2)nc1-c1cc2c(CCNC2=O)[nH]1
Show InChI InChI=1S/C19H17FN4O3/c1-26-16-9-22-17(10-27-12-4-2-11(20)3-5-12)24-18(16)15-8-13-14(23-15)6-7-21-19(13)25/h2-5,8-9,23H,6-7,10H2,1H3,(H,21,25)
NCI pathway
Reactome pathway
n/an/a 146n/an/an/an/an/an/a
TBA
Curated by ChEMBL
Assay Description
Inhibition of CK1-alpha using biotin[long chain]-KKRRRAL{pS}VATLPGL substrate in presence of 8 uM ATP
ACS Med Chem Lett 3: 1059-1064 (2012)
Article DOI: 10.1021/ml300278f
BindingDB Entry DOI: 10.7270/Q21V5G41
Casein kinase I isoform delta
(Homo sapiens (Human))
BDBM50400745
(CHEMBL2203559)
Show SMILES COc1cnc(COc2ccc(F)cc2)nc1-c1cc2c(CCNC2=O)[nH]1
Show InChI InChI=1S/C19H17FN4O3/c1-26-16-9-22-17(10-27-12-4-2-11(20)3-5-12)24-18(16)15-8-13-14(23-15)6-7-21-19(13)25/h2-5,8-9,23H,6-7,10H2,1H3,(H,21,25)
n/an/a 58n/an/an/an/an/an/a
TBA
Curated by ChEMBL
Assay Description
Inhibition of CK1-delta using biotin[long chain]-KKRRRAL{pS}VATLPGL substrate in presence of 11 uM ATP
ACS Med Chem Lett 3: 1059-1064 (2012)
Article DOI: 10.1021/ml300278f
BindingDB Entry DOI: 10.7270/Q21V5G41
Glycogen synthase kinase-3 beta
(Homo sapiens (Human))
BDBM50400745
(CHEMBL2203559)
Show SMILES COc1cnc(COc2ccc(F)cc2)nc1-c1cc2c(CCNC2=O)[nH]1
Show InChI InChI=1S/C19H17FN4O3/c1-26-16-9-22-17(10-27-12-4-2-11(20)3-5-12)24-18(16)15-8-13-14(23-15)6-7-21-19(13)25/h2-5,8-9,23H,6-7,10H2,1H3,(H,21,25)
NCI pathway
Reactome pathway
n/an/a 1.12E+3n/an/an/an/an/an/a
TBA
Curated by ChEMBL
Assay Description
Inhibition of GSK3beta
ACS Med Chem Lett 3: 1059-1064 (2012)
Article DOI: 10.1021/ml300278f
BindingDB Entry DOI: 10.7270/Q21V5G41
Casein kinase I
(Homo sapiens (Human))
BDBM50400745
(CHEMBL2203559)
Show SMILES COc1cnc(COc2ccc(F)cc2)nc1-c1cc2c(CCNC2=O)[nH]1
Show InChI InChI=1S/C19H17FN4O3/c1-26-16-9-22-17(10-27-12-4-2-11(20)3-5-12)24-18(16)15-8-13-14(23-15)6-7-21-19(13)25/h2-5,8-9,23H,6-7,10H2,1H3,(H,21,25)
NCI pathway
Reactome pathway
n/an/a 24n/an/an/an/an/an/a
TBA
Curated by ChEMBL
Assay Description
Inhibition of CK1-gamma 2 using biotin[long chain]-KKRRRAL{pS}VATLPGL substrate in presence of 32 uM ATP
ACS Med Chem Lett 3: 1059-1064 (2012)
Article DOI: 10.1021/ml300278f
BindingDB Entry DOI: 10.7270/Q21V5G41