BDBM50400907 CHEMBL2205033
SMILES: CN1CCN(CC1)c1ccccc1Sc1ccc(C)cc1C
InChI Key: InChIKey=ONIODQRFDDUVAG-UHFFFAOYSA-N
Data: 2 KI  1 IC50
Activity Spreadsheet -- Enzyme Inhibition Constant Data from BindingDB
Found 3 hits for monomerid = 50400907
Trg + Lig
Ki
nM
ΔG°
kcal/mole
IC50
nM
Kd
nM
EC50/IC50
nM
koff
s-1
kon
M-1s-1
pHTemp
°C
5-hydroxytryptamine receptor 1A
(Homo sapiens (Human))
BDBM50400907
(CHEMBL2205033)
Show SMILES CN1CCN(CC1)c1ccccc1Sc1ccc(C)cc1C
Show InChI InChI=1S/C19H24N2S/c1-15-8-9-18(16(2)14-15)22-19-7-5-4-6-17(19)21-12-10-20(3)11-13-21/h4-9,14H,10-13H2,1-3H3
120n/an/an/an/an/an/an/an/a
H. Lundbeck A/S
Curated by ChEMBL
Assay Description
Displacement of [3H]5-carboxamidotryptamine to human 5HT1A expressed in HEK293 cells by filter binding assay
J Med Chem 54: 3206-21 (2011)
Article DOI: 10.1021/jm101459g
BindingDB Entry DOI: 10.7270/Q2W37XFC
5-hydroxytryptamine receptor 3A
(Homo sapiens (Human))
BDBM50400907
(CHEMBL2205033)
Show SMILES CN1CCN(CC1)c1ccccc1Sc1ccc(C)cc1C
Show InChI InChI=1S/C19H24N2S/c1-15-8-9-18(16(2)14-15)22-19-7-5-4-6-17(19)21-12-10-20(3)11-13-21/h4-9,14H,10-13H2,1-3H3
Reactome pathway
130n/an/an/an/an/an/an/an/a
H. Lundbeck A/S
Curated by ChEMBL
Assay Description
Displacement of [3H]granisetron from human 5HT3A receptor expressed in HEK293 cells by filter binding assay
J Med Chem 54: 3206-21 (2011)
Article DOI: 10.1021/jm101459g
BindingDB Entry DOI: 10.7270/Q2W37XFC
Sodium-dependent serotonin transporter
(Rattus norvegicus (rat))
BDBM50400907
(CHEMBL2205033)
Show SMILES CN1CCN(CC1)c1ccccc1Sc1ccc(C)cc1C
Show InChI InChI=1S/C19H24N2S/c1-15-8-9-18(16(2)14-15)22-19-7-5-4-6-17(19)21-12-10-20(3)11-13-21/h4-9,14H,10-13H2,1-3H3
n/an/a 680n/an/an/an/an/an/a
H. Lundbeck A/S
Curated by ChEMBL
Assay Description
Inhibition of SERT-mediated [3H]5HT uptake in rat synaptosomes by scintillation counting
J Med Chem 54: 3206-21 (2011)
Article DOI: 10.1021/jm101459g
BindingDB Entry DOI: 10.7270/Q2W37XFC