BDBM50400908 CHEMBL2205032
SMILES: Cc1ccc(Sc2c(C)cccc2N2CCNCC2)c(C)c1
InChI Key: InChIKey=CZXYEUKDTXJZAI-UHFFFAOYSA-N
Data: 2 KI  1 IC50
Activity Spreadsheet -- Enzyme Inhibition Constant Data from BindingDB
Found 3 hits for monomerid = 50400908
Trg + Lig
Ki
nM
ΔG°
kcal/mole
IC50
nM
Kd
nM
EC50/IC50
nM
koff
s-1
kon
M-1s-1
pHTemp
°C
5-hydroxytryptamine receptor 1A
(Homo sapiens (Human))
BDBM50400908
(CHEMBL2205032)
Show SMILES Cc1ccc(Sc2c(C)cccc2N2CCNCC2)c(C)c1
Show InChI InChI=1S/C19H24N2S/c1-14-7-8-18(16(3)13-14)22-19-15(2)5-4-6-17(19)21-11-9-20-10-12-21/h4-8,13,20H,9-12H2,1-3H3
540n/an/an/an/an/an/an/an/a
H. Lundbeck A/S
Curated by ChEMBL
Assay Description
Displacement of [3H]5-carboxamidotryptamine to human 5HT1A expressed in HEK293 cells by filter binding assay
J Med Chem 54: 3206-21 (2011)
Article DOI: 10.1021/jm101459g
BindingDB Entry DOI: 10.7270/Q2W37XFC
5-hydroxytryptamine receptor 3A
(Homo sapiens (Human))
BDBM50400908
(CHEMBL2205032)
Show SMILES Cc1ccc(Sc2c(C)cccc2N2CCNCC2)c(C)c1
Show InChI InChI=1S/C19H24N2S/c1-14-7-8-18(16(3)13-14)22-19-15(2)5-4-6-17(19)21-11-9-20-10-12-21/h4-8,13,20H,9-12H2,1-3H3
Reactome pathway
670n/an/an/an/an/an/an/an/a
H. Lundbeck A/S
Curated by ChEMBL
Assay Description
Displacement of [3H]granisetron from human 5HT3A receptor expressed in HEK293 cells by filter binding assay
J Med Chem 54: 3206-21 (2011)
Article DOI: 10.1021/jm101459g
BindingDB Entry DOI: 10.7270/Q2W37XFC
Sodium-dependent serotonin transporter
(Rattus norvegicus (rat))
BDBM50400908
(CHEMBL2205032)
Show SMILES Cc1ccc(Sc2c(C)cccc2N2CCNCC2)c(C)c1
Show InChI InChI=1S/C19H24N2S/c1-14-7-8-18(16(3)13-14)22-19-15(2)5-4-6-17(19)21-11-9-20-10-12-21/h4-8,13,20H,9-12H2,1-3H3
n/an/a 540n/an/an/an/an/an/a
H. Lundbeck A/S
Curated by ChEMBL
Assay Description
Inhibition of SERT-mediated [3H]5HT uptake in rat synaptosomes by scintillation counting
J Med Chem 54: 3206-21 (2011)
Article DOI: 10.1021/jm101459g
BindingDB Entry DOI: 10.7270/Q2W37XFC