BDBM50401021 CHEMBL2203665
SMILES: OC[C@H]1O[C@@H](O[C@@H]2[C@@H](CO)O[C@H]([C@H](O)[C@H]2O)n2cc(nn2)-c2ccc(cc2)-c2cn(nn2)[C@@H]2O[C@H](CO)[C@@H](O[C@@H]3O[C@H](CO)[C@H](O)[C@H](O)[C@H]3O)[C@H](O)[C@H]2O)[C@H](O)[C@@H](O)[C@H]1O
InChI Key: InChIKey=JVLYNQSDFXWRCF-CPGAUQLISA-N
Data: 6 IC50
Activity Spreadsheet -- Enzyme Inhibition Constant Data from BindingDB
Found 6 hits for monomerid = 50401021
Trg + Lig
Ki
nM
ΔG°
kcal/mole
IC50
nM
Kd
nM
EC50/IC50
nM
koff
s-1
kon
M-1s-1
pHTemp
°C
Galectin-3
(Gallus gallus)
BDBM50401021
(CHEMBL2203665)
Show SMILES OC[C@H]1O[C@@H](O[C@@H]2[C@@H](CO)O[C@H]([C@H](O)[C@H]2O)n2cc(nn2)-c2ccc(cc2)-c2cn(nn2)[C@@H]2O[C@H](CO)[C@@H](O[C@@H]3O[C@H](CO)[C@H](O)[C@H](O)[C@H]3O)[C@H](O)[C@H]2O)[C@H](O)[C@@H](O)[C@H]1O |r|
Show InChI InChI=1S/C34H48N6O20/c41-7-15-19(45)21(47)27(53)33(57-15)59-29-17(9-43)55-31(25(51)23(29)49)39-5-13(35-37-39)11-1-2-12(4-3-11)14-6-40(38-36-14)32-26(52)24(50)30(18(10-44)56-32)60-34-28(54)22(48)20(46)16(8-42)58-34/h1-6,15-34,41-54H,7-10H2/t15-,16-,17-,18-,19+,20+,21+,22+,23-,24-,25-,26-,27-,28-,29-,30-,31-,32-,33+,34+/m1/s1
Reactome pathway
n/an/a 1.50E+6n/an/an/an/an/an/a
Ludwig-Maximilians-University Munich
Curated by ChEMBL
Assay Description
Inhibition of binding of biotinylated truncated chicken galectin-3 to surface immobilized asialofetuin by solid phase assay relative to free lactose
Bioorg Med Chem Lett 22: 313-8 (2011)
Article DOI: 10.1016/j.bmcl.2011.11.010
BindingDB Entry DOI: 10.7270/Q2KP83BJ
Galectin-3
(Gallus gallus)
BDBM50401021
(CHEMBL2203665)
Show SMILES OC[C@H]1O[C@@H](O[C@@H]2[C@@H](CO)O[C@H]([C@H](O)[C@H]2O)n2cc(nn2)-c2ccc(cc2)-c2cn(nn2)[C@@H]2O[C@H](CO)[C@@H](O[C@@H]3O[C@H](CO)[C@H](O)[C@H](O)[C@H]3O)[C@H](O)[C@H]2O)[C@H](O)[C@@H](O)[C@H]1O |r|
Show InChI InChI=1S/C34H48N6O20/c41-7-15-19(45)21(47)27(53)33(57-15)59-29-17(9-43)55-31(25(51)23(29)49)39-5-13(35-37-39)11-1-2-12(4-3-11)14-6-40(38-36-14)32-26(52)24(50)30(18(10-44)56-32)60-34-28(54)22(48)20(46)16(8-42)58-34/h1-6,15-34,41-54H,7-10H2/t15-,16-,17-,18-,19+,20+,21+,22+,23-,24-,25-,26-,27-,28-,29-,30-,31-,32-,33+,34+/m1/s1
Reactome pathway
n/an/a 3.10E+6n/an/an/an/an/an/a
Ludwig-Maximilians-University Munich
Curated by ChEMBL
Assay Description
Inhibition of binding of biotinylated truncated chicken galectin-3 to surface immobilized asialofetuin by solid phase assay
Bioorg Med Chem Lett 22: 313-8 (2011)
Article DOI: 10.1016/j.bmcl.2011.11.010
BindingDB Entry DOI: 10.7270/Q2KP83BJ
Beta-galactoside-binding lectin
(Gallus gallus)
BDBM50401021
(CHEMBL2203665)
Show SMILES OC[C@H]1O[C@@H](O[C@@H]2[C@@H](CO)O[C@H]([C@H](O)[C@H]2O)n2cc(nn2)-c2ccc(cc2)-c2cn(nn2)[C@@H]2O[C@H](CO)[C@@H](O[C@@H]3O[C@H](CO)[C@H](O)[C@H](O)[C@H]3O)[C@H](O)[C@H]2O)[C@H](O)[C@@H](O)[C@H]1O |r|
Show InChI InChI=1S/C34H48N6O20/c41-7-15-19(45)21(47)27(53)33(57-15)59-29-17(9-43)55-31(25(51)23(29)49)39-5-13(35-37-39)11-1-2-12(4-3-11)14-6-40(38-36-14)32-26(52)24(50)30(18(10-44)56-32)60-34-28(54)22(48)20(46)16(8-42)58-34/h1-6,15-34,41-54H,7-10H2/t15-,16-,17-,18-,19+,20+,21+,22+,23-,24-,25-,26-,27-,28-,29-,30-,31-,32-,33+,34+/m1/s1
n/an/a 1.50E+6n/an/an/an/an/an/a
Ludwig-Maximilians-University Munich
Curated by ChEMBL
Assay Description
Inhibition of binding of biotinylated chicken galectin-1B to surface immobilized asialofetuin by solid phase assay
Bioorg Med Chem Lett 22: 313-8 (2011)
Article DOI: 10.1016/j.bmcl.2011.11.010
BindingDB Entry DOI: 10.7270/Q2KP83BJ
Galectin-3
(Gallus gallus)
BDBM50401021
(CHEMBL2203665)
Show SMILES OC[C@H]1O[C@@H](O[C@@H]2[C@@H](CO)O[C@H]([C@H](O)[C@H]2O)n2cc(nn2)-c2ccc(cc2)-c2cn(nn2)[C@@H]2O[C@H](CO)[C@@H](O[C@@H]3O[C@H](CO)[C@H](O)[C@H](O)[C@H]3O)[C@H](O)[C@H]2O)[C@H](O)[C@@H](O)[C@H]1O |r|
Show InChI InChI=1S/C34H48N6O20/c41-7-15-19(45)21(47)27(53)33(57-15)59-29-17(9-43)55-31(25(51)23(29)49)39-5-13(35-37-39)11-1-2-12(4-3-11)14-6-40(38-36-14)32-26(52)24(50)30(18(10-44)56-32)60-34-28(54)22(48)20(46)16(8-42)58-34/h1-6,15-34,41-54H,7-10H2/t15-,16-,17-,18-,19+,20+,21+,22+,23-,24-,25-,26-,27-,28-,29-,30-,31-,32-,33+,34+/m1/s1
Reactome pathway
n/an/a 7.00E+4n/an/an/an/an/an/a
Ludwig-Maximilians-University Munich
Curated by ChEMBL
Assay Description
Inhibition of binding of biotinylated chicken galectin-3 to surface immobilized asialofetuin by solid phase assay
Bioorg Med Chem Lett 22: 313-8 (2011)
Article DOI: 10.1016/j.bmcl.2011.11.010
BindingDB Entry DOI: 10.7270/Q2KP83BJ
Beta-galactoside-binding lectin
(Gallus gallus)
BDBM50401021
(CHEMBL2203665)
Show SMILES OC[C@H]1O[C@@H](O[C@@H]2[C@@H](CO)O[C@H]([C@H](O)[C@H]2O)n2cc(nn2)-c2ccc(cc2)-c2cn(nn2)[C@@H]2O[C@H](CO)[C@@H](O[C@@H]3O[C@H](CO)[C@H](O)[C@H](O)[C@H]3O)[C@H](O)[C@H]2O)[C@H](O)[C@@H](O)[C@H]1O |r|
Show InChI InChI=1S/C34H48N6O20/c41-7-15-19(45)21(47)27(53)33(57-15)59-29-17(9-43)55-31(25(51)23(29)49)39-5-13(35-37-39)11-1-2-12(4-3-11)14-6-40(38-36-14)32-26(52)24(50)30(18(10-44)56-32)60-34-28(54)22(48)20(46)16(8-42)58-34/h1-6,15-34,41-54H,7-10H2/t15-,16-,17-,18-,19+,20+,21+,22+,23-,24-,25-,26-,27-,28-,29-,30-,31-,32-,33+,34+/m1/s1
n/an/a 2.70E+6n/an/an/an/an/an/a
Ludwig-Maximilians-University Munich
Curated by ChEMBL
Assay Description
Inhibition of binding of biotinylated chicken galectin-1B to surface immobilized asialofetuin by solid phase assay relative to free lactose
Bioorg Med Chem Lett 22: 313-8 (2011)
Article DOI: 10.1016/j.bmcl.2011.11.010
BindingDB Entry DOI: 10.7270/Q2KP83BJ
Galectin-3
(Gallus gallus)
BDBM50401021
(CHEMBL2203665)
Show SMILES OC[C@H]1O[C@@H](O[C@@H]2[C@@H](CO)O[C@H]([C@H](O)[C@H]2O)n2cc(nn2)-c2ccc(cc2)-c2cn(nn2)[C@@H]2O[C@H](CO)[C@@H](O[C@@H]3O[C@H](CO)[C@H](O)[C@H](O)[C@H]3O)[C@H](O)[C@H]2O)[C@H](O)[C@@H](O)[C@H]1O |r|
Show InChI InChI=1S/C34H48N6O20/c41-7-15-19(45)21(47)27(53)33(57-15)59-29-17(9-43)55-31(25(51)23(29)49)39-5-13(35-37-39)11-1-2-12(4-3-11)14-6-40(38-36-14)32-26(52)24(50)30(18(10-44)56-32)60-34-28(54)22(48)20(46)16(8-42)58-34/h1-6,15-34,41-54H,7-10H2/t15-,16-,17-,18-,19+,20+,21+,22+,23-,24-,25-,26-,27-,28-,29-,30-,31-,32-,33+,34+/m1/s1
Reactome pathway
n/an/a 1.57E+7n/an/an/an/an/an/a
Ludwig-Maximilians-University Munich
Curated by ChEMBL
Assay Description
Inhibition of binding of biotinylated chicken galectin-3 to surface immobilized asialofetuin by solid phase assay relative to free lactose
Bioorg Med Chem Lett 22: 313-8 (2011)
Article DOI: 10.1016/j.bmcl.2011.11.010
BindingDB Entry DOI: 10.7270/Q2KP83BJ