BDBM50401120 CHEMBL2204470
SMILES: Cc1c(CC2=NN(Cc3ccc(F)cc3F)C(=O)CC2)c2cc(F)ccc2n1CC(O)=O
InChI Key: InChIKey=ISLLQTIESCIYPR-UHFFFAOYSA-N
Data: 1 IC50
Activity Spreadsheet -- Enzyme Inhibition Constant Data from BindingDB
Found 1 hit for monomerid = 50401120
Trg + Lig
Ki
nM
ΔG°
kcal/mole
IC50
nM
Kd
nM
EC50/IC50
nM
koff
s-1
kon
M-1s-1
pHTemp
°C
G protein-coupled receptor 44
(Homo sapiens (Human))
BDBM50401120
(CHEMBL2204470)
Show SMILES Cc1c(CC2=NN(Cc3ccc(F)cc3F)C(=O)CC2)c2cc(F)ccc2n1CC(O)=O |t:4|
Show InChI InChI=1S/C23H20F3N3O3/c1-13-18(19-8-15(24)4-6-21(19)28(13)12-23(31)32)10-17-5-7-22(30)29(27-17)11-14-2-3-16(25)9-20(14)26/h2-4,6,8-9H,5,7,10-12H2,1H3,(H,31,32)
Reactome pathway
n/an/a 4n/an/an/an/an/an/a
Pfizer Inc.
Curated by ChEMBL
Assay Description
Displacement of [3H]PGD2 from recombinant human CRTH2 receptor expressed in CHO-K1 cells after 30 min by FRET method
J Med Chem 55: 5088-109 (2012)
Article DOI: 10.1021/jm300007n
BindingDB Entry DOI: 10.7270/Q2S75HH0