BDBM50401291 CHEMBL2204527
SMILES: CC(=O)Nc1nc2cnc(Nc3cc(NC(=O)c4cccc(CC(C)(C)C#N)c4)ccc3C)nc2s1
InChI Key: InChIKey=INZKYFAYQUYDOC-UHFFFAOYSA-N
Data: 1 IC50
Activity Spreadsheet -- Enzyme Inhibition Constant Data from BindingDB
Found 1 hit for monomerid = 50401291
Trg + Lig
Ki
nM
ΔG°
kcal/mole
IC50
nM
Kd
nM
EC50/IC50
nM
koff
s-1
kon
M-1s-1
pHTemp
°C
Vascular endothelial growth factor receptor 2
(Homo sapiens (Human))
BDBM50401291
(CHEMBL2204527)
Show SMILES CC(=O)Nc1nc2cnc(Nc3cc(NC(=O)c4cccc(CC(C)(C)C#N)c4)ccc3C)nc2s1
Show InChI InChI=1S/C26H25N7O2S/c1-15-8-9-19(30-22(35)18-7-5-6-17(10-18)12-26(3,4)14-27)11-20(15)31-24-28-13-21-23(33-24)36-25(32-21)29-16(2)34/h5-11,13H,12H2,1-4H3,(H,30,35)(H,28,31,33)(H,29,32,34)
NCI pathway
Reactome pathway
n/an/a 300n/an/an/an/an/an/a
Takeda Pharmaceutical Company Limited
Curated by ChEMBL
Assay Description
Inhibition of VEGFR2 in HUVEC assessed as reduction of VGF-stimulated cell proliferation after 5 days
Bioorg Med Chem 20: 5600-15 (2012)
Article DOI: 10.1016/j.bmc.2012.07.032
BindingDB Entry DOI: 10.7270/Q2765GH8