BDBM50401329 CHEMBL2205225
SMILES: CCc1cc2n(C)c(C(=O)NC3CCN(CC3)C(=O)CO)c(OC)c2c(=O)n1CC(=O)c1ccccc1
InChI Key: InChIKey=XNWXDOREQLTFFG-UHFFFAOYSA-N
Data: 1 IC50
Activity Spreadsheet -- Enzyme Inhibition Constant Data from BindingDB
Found 1 hit for monomerid = 50401329
Trg + Lig
Ki
nM
ΔG°
kcal/mole
IC50
nM
Kd
nM
EC50/IC50
nM
koff
s-1
kon
M-1s-1
pHTemp
°C
Sonic hedgehog protein
(Mus musculus (Mouse))
BDBM50401329
(CHEMBL2205225)
Show SMILES CCc1cc2n(C)c(C(=O)NC3CCN(CC3)C(=O)CO)c(OC)c2c(=O)n1CC(=O)c1ccccc1
Show InChI InChI=1S/C27H32N4O6/c1-4-19-14-20-23(27(36)31(19)15-21(33)17-8-6-5-7-9-17)25(37-3)24(29(20)2)26(35)28-18-10-12-30(13-11-18)22(34)16-32/h5-9,14,18,32H,4,10-13,15-16H2,1-3H3,(H,28,35)
n/an/a 5.70n/an/an/an/an/an/a
Takeda Pharmaceutical Company Limited
Curated by ChEMBL
Assay Description
Inhibition of recombinant mouse Shh-N expressed in mouse NIH3T3/Gli-luc cells assessed as inhibition of Gli1 expression after 48 hrs by luciferase re...
Bioorg Med Chem 20: 5507-17 (2012)
Article DOI: 10.1016/j.bmc.2012.07.034
BindingDB Entry DOI: 10.7270/Q2ZS2XP4