BDBM50401429 CHEMBL2207501
SMILES: Cc1nc(CN2CCN(CC2)c2c(Cl)cnc3nc([nH]c23)-c2cn(C)nc2C)no1
InChI Key: InChIKey=ZYQKMYRXVHUATB-UHFFFAOYSA-N
Data: 2 IC50  1 Kd
Activity Spreadsheet -- Enzyme Inhibition Constant Data from BindingDB
Found 3 hits for monomerid = 50401429
Trg + Lig
Ki
nM
ΔG°
kcal/mole
IC50
nM
Kd
nM
EC50/IC50
nM
koff
s-1
kon
M-1s-1
pHTemp
°C
Aurora kinase A
(Homo sapiens (Human))
BDBM50401429
(CHEMBL2207501)
Show SMILES Cc1nc(CN2CCN(CC2)c2c(Cl)cnc3nc([nH]c23)-c2cn(C)nc2C)no1
Show InChI InChI=1S/C19H22ClN9O/c1-11-13(9-27(3)25-11)18-23-16-17(14(20)8-21-19(16)24-18)29-6-4-28(5-7-29)10-15-22-12(2)30-26-15/h8-9H,4-7,10H2,1-3H3,(H,21,23,24)
NCI pathway
Reactome pathway
n/an/a 52n/an/an/an/an/an/a
The Institute of Cancer Research
Curated by ChEMBL
Assay Description
Binding affinity to Aurora A kinase
J Med Chem 55: 8721-34 (2012)
Article DOI: 10.1021/jm300952s
BindingDB Entry DOI: 10.7270/Q22J6D2W
Receptor-type tyrosine-protein kinase FLT3
(Homo sapiens (Human))
BDBM50401429
(CHEMBL2207501)
Show SMILES Cc1nc(CN2CCN(CC2)c2c(Cl)cnc3nc([nH]c23)-c2cn(C)nc2C)no1
Show InChI InChI=1S/C19H22ClN9O/c1-11-13(9-27(3)25-11)18-23-16-17(14(20)8-21-19(16)24-18)29-6-4-28(5-7-29)10-15-22-12(2)30-26-15/h8-9H,4-7,10H2,1-3H3,(H,21,23,24)
n/an/an/a 5.60n/an/an/an/an/a
The Institute of Cancer Research
Curated by ChEMBL
Assay Description
Binding affinity to FLT3
J Med Chem 55: 8721-34 (2012)
Article DOI: 10.1021/jm300952s
BindingDB Entry DOI: 10.7270/Q22J6D2W
Potassium voltage-gated channel subfamily H member 2
(Homo sapiens (Human))
BDBM50401429
(CHEMBL2207501)
Show SMILES Cc1nc(CN2CCN(CC2)c2c(Cl)cnc3nc([nH]c23)-c2cn(C)nc2C)no1
Show InChI InChI=1S/C19H22ClN9O/c1-11-13(9-27(3)25-11)18-23-16-17(14(20)8-21-19(16)24-18)29-6-4-28(5-7-29)10-15-22-12(2)30-26-15/h8-9H,4-7,10H2,1-3H3,(H,21,23,24)
Reactome pathway
n/an/a 9.50E+3n/an/an/an/an/an/a
The Institute of Cancer Research
Curated by ChEMBL
Assay Description
Inhibition of human ERG by whole-cell voltage clamping
J Med Chem 55: 8721-34 (2012)
Article DOI: 10.1021/jm300952s
BindingDB Entry DOI: 10.7270/Q22J6D2W