BDBM50401447 CHEMBL2203767
SMILES: CCN1CCN(CC1)c1ccc(cc1)-c1nc2ncc(Cl)c(N3CCN(Cc4cc(C)on4)CC3)c2[nH]1
InChI Key: InChIKey=UKHPKEUUBHOOEY-UHFFFAOYSA-N
Data: 1 IC50
Activity Spreadsheet -- Enzyme Inhibition Constant Data from BindingDB
Found 1 hit for monomerid = 50401447
Trg + Lig
Ki
nM
ΔG°
kcal/mole
IC50
nM
Kd
nM
EC50/IC50
nM
koff
s-1
kon
M-1s-1
pHTemp
°C
Aurora kinase A
(Homo sapiens (Human))
BDBM50401447
(CHEMBL2203767)
Show SMILES CCN1CCN(CC1)c1ccc(cc1)-c1nc2ncc(Cl)c(N3CCN(Cc4cc(C)on4)CC3)c2[nH]1
Show InChI InChI=1S/C27H33ClN8O/c1-3-33-8-12-35(13-9-33)22-6-4-20(5-7-22)26-30-24-25(23(28)17-29-27(24)31-26)36-14-10-34(11-15-36)18-21-16-19(2)37-32-21/h4-7,16-17H,3,8-15,18H2,1-2H3,(H,29,30,31)
NCI pathway
Reactome pathway
n/an/a 6n/an/an/an/an/an/a
The Institute of Cancer Research
Curated by ChEMBL
Assay Description
Binding affinity to Aurora A kinase
J Med Chem 55: 8721-34 (2012)
Article DOI: 10.1021/jm300952s
BindingDB Entry DOI: 10.7270/Q22J6D2W