BDBM50401456 CHEMBL2204548
SMILES: O=c1nc(oc2c(OCc3cccnc3)cccc12)N(Cc1cccnc1)c1cccnc1
InChI Key: InChIKey=GRBGZWQVUFTGOF-UHFFFAOYSA-N
Data: 1 IC50
Activity Spreadsheet -- Enzyme Inhibition Constant Data from BindingDB
Found 1 hit for monomerid = 50401456
Trg + Lig
Ki
nM
ΔG°
kcal/mole
IC50
nM
Kd
nM
EC50/IC50
nM
koff
s-1
kon
M-1s-1
pHTemp
°C
DNA-dependent protein kinase catalytic subunit
(Homo sapiens (Human))
BDBM50401456
(CHEMBL2204548)
Show SMILES O=c1nc(oc2c(OCc3cccnc3)cccc12)N(Cc1cccnc1)c1cccnc1
Show InChI InChI=1S/C25H19N5O3/c31-24-21-8-1-9-22(32-17-19-6-3-11-27-14-19)23(21)33-25(29-24)30(20-7-4-12-28-15-20)16-18-5-2-10-26-13-18/h1-15H,16-17H2
n/an/a 1.35E+4n/an/an/an/an/an/a
La Trobe University
Curated by ChEMBL
Assay Description
Inhibition of DNA-PK using EPPLSQEAFADLWKK as substrate after 5 mins by ADP-Glo kinase assay
Eur J Med Chem 57: 85-101 (2012)
Article DOI: 10.1016/j.ejmech.2012.08.035
BindingDB Entry DOI: 10.7270/Q2XS5WK6